[Bug releng/17884] New: Fresh upstream bits based on git commit 81acc574 do not compile on RHEL[56].
mcermak at redhat dot com
sourceware-bugzilla@sourceware.org
Tue Jan 27 09:29:00 GMT 2015
https://sourceware.org/bugzilla/show_bug.cgi?id=17884
Bug ID: 17884
Summary: Fresh upstream bits based on git commit 81acc574 do
not compile on RHEL[56].
Product: systemtap
Version: unspecified
Status: NEW
Severity: normal
Priority: P2
Component: releng
Assignee: systemtap at sourceware dot org
Reporter: mcermak at redhat dot com
Fresh upstream bits based on git commit 81acc574 do not compile on RHEL[56].
CXX stap-dwflpp.o
dwflpp.cxx: In member function ‘int dwflpp::iterate_over_plt(T*, void (*)(T*,
const char*, size_t)) [with T = void]’:
dwflpp.cxx:1426: error: ‘EM_AARCH64’ was not declared in this scope
make[2]: *** [stap-dwflpp.o] Error 1
make[2]: Leaving directory `/root/mcermak-systemtap/systemtap'
make[1]: *** [all-recursive] Error 1
make[1]: Leaving directory `/root/mcermak-systemtap/systemtap'
make: *** [all] Error 2
Looks like caused by commit 81acc574. RHEL7 and Fedora do not seem to be
affected.
--
You are receiving this mail because:
You are the assignee for the bug.
More information about the Systemtap
mailing list