[Bug runtime/10821] New: unwind_frame has an oversized frame
jistone at redhat dot com
sourceware-bugzilla@sourceware.org
Wed Oct 21 16:06:00 GMT 2009
On 2.6.30.8-64.fc11.x86_64:
$ stap -p4 ../testsuite/buildok/context_test.stp
cc1: warnings being treated as errors
In file included from /usr/local/share/systemtap/runtime/stack.c:26,
from
/tmp/stapcvUvUt/stap_7aca071c79275fba5c92f0959120a18d_8494.c:52:
/usr/local/share/systemtap/runtime/unwind.c: In function Âunwind_frameÂ:
/usr/local/share/systemtap/runtime/unwind.c:862: error: the frame size of 544
bytes is larger than 512 bytes
make[1]: *** [/tmp/stapcvUvUt/stap_7aca071c79275fba5c92f0959120a18d_8494.o] Error 1
make: *** [_module_/tmp/stapcvUvUt] Error 2
Pass 4: compilation failed. Try again with another '--vp 0001' option.
--
Summary: unwind_frame has an oversized frame
Product: systemtap
Version: unspecified
Status: NEW
Severity: normal
Priority: P2
Component: runtime
AssignedTo: systemtap at sources dot redhat dot com
ReportedBy: jistone at redhat dot com
http://sourceware.org/bugzilla/show_bug.cgi?id=10821
------- You are receiving this mail because: -------
You are the assignee for the bug, or are watching the assignee.
More information about the Systemtap
mailing list