still have problems with complex on alpha osf
Fitzgerald, Joe
Joe.Fitzgerald@compaq.com
Sat Apr 1 00:00:00 GMT 2000
hi, i downloaded the latest snapshot and am still seeing the egcs compiler
problem with complex. from the mail archive it seemed that a workaround for
this had been included in the latest snapshot, but for some reason, this
error still appears. any help would be appreciated
here is the error i am seeing:
on alphaev56-dec-osf4.0f, compiling the libstdc++-2.90.7snapshot with gcc
2.95.2:
/bin/sh ../libtool --mode=compile gcc -DHAVE_CONFIG_H -I.
-I../../libstdc++-2.90.7/math -I.. -g -O2 -c
../../libstdc++-2.90.7/math/mycabsf.c
rm -f .libs/mycabsf.lo
gcc -DHAVE_CONFIG_H -I. -I../../libstdc++-2.90.7/math -I.. -g -O2 -c -DPIC
../../libstdc++-2.90.7/math/mycabsf.c -o .libs/mycabsf.lo
../../libstdc++-2.90.7/math/mycabsf.c: In function `__mycabsf':
../../libstdc++-2.90.7/math/mycabsf.c:36: Unable to access imaginary part of
complex value in a hard register on this target
make[2]: *** [mycabsf.lo] Error 1
make[2]: Leaving directory `/cadunx/hansolo/people/jfitz/gnu/objdir/math'
make[1]: *** [all-recursive] Error 1
make[1]: Leaving directory `/cadunx/hansolo/people/jfitz/gnu/objdir'
make: *** [all-recursive-am] Error 2
thanks,
joe
More information about the Libstdc++
mailing list