Build bot failure i686.
Carlos O'Donell
carlos@redhat.com
Sat Feb 28 20:08:00 GMT 2015
Why does the build bot fail check for i686 with:
In file included from inl-tester.c:6:0:
tester.c: In function âtest_memcmpâ:
tester.c:1097:7: error: value computed is not used [-Werror=unused-value]
tester.c:1098:7: error: value computed is not used [-Werror=unused-value]
cc1: all warnings being treated as errors
make[2]: *** [/mnt/b/glibc-slave1/glibc-i686-linux/build/build/string/inl-tester.o] Error 1
Does anyone else see this?
This looks like a compiler issue on the build bot.
Cheers,
Carlos.
More information about the Libc-alpha
mailing list