problem with sidcpuutil.h
Dzung Nguyen
dunguyen@iol.unh.edu
Fri Nov 22 08:39:00 GMT 2002
Hi. The following error occured when we built toolchain with
bootstrap-gcc_3.2 on our alphaev56 machine:
/mnt/u9/toolchain/buildsys/source/toolchain/sid/component/bochs/vga/../../../include/sidcpuutil.h:233:
warning: ANSI C++ forbids declaration `cpu_trace_stream' with no type
/mnt/u9/toolchain/buildsys/source/toolchain/sid/component/bochs/vga/../../../include/sidcpuutil.h:233:
structure `::sidutil::basic_cpu' not yet defined
/mnt/u9/toolchain/buildsys/source/toolchain/sid/component/bochs/vga/../../../include/sidcpuutil.h:233:
confused by earlier errors, bailing out
make[7]: *** [sid-vga-wrapper.lo] Error 1
make[7]: Leaving directory
`/mnt/u9/toolchain/buildsys/build/alpha9/basic/native/toolchain/sid/component/bochs/vga'
make[6]: *** [all-recursive] Error 1
make[6]: Leaving directory
`/mnt/u9/toolchain/buildsys/build/alpha9/basic/native/toolchain/sid/component/bochs'
make[5]: *** [all-recursive-am] Error 2
make[5]: Leaving directory
`/mnt/u9/toolchain/buildsys/build/alpha9/basic/native/toolchain/sid/component/bochs'
make[4]: *** [all-recursive] Error 1
make[4]: Leaving directory
`/mnt/u9/toolchain/buildsys/build/alpha9/basic/native/toolchain/sid/component'
make[3]: *** [all-recursive-am] Error 2
make[3]: Leaving directory
`/mnt/u9/toolchain/buildsys/build/alpha9/basic/native/toolchain/sid/component'
make[2]: *** [all-recursive] Error 1
make[2]: Leaving directory
`/mnt/u9/toolchain/buildsys/build/alpha9/basic/native/toolchain/sid'
make[1]: *** [all-sid] Error 2
make[1]: Leaving directory
`/mnt/u9/toolchain/buildsys/build/alpha9/basic/native/toolchain'
make: *** [bootstrap] Error 2
Any help to fix this problem would be appreciated. Thanks.
--
Dzung V. Nguyen email: dunguyen@iol.unh.edu
Alpha Linux Group http://linux.iol.unh.edu/clp
InterOperability Laboratory
University of New Hampshire phone: (603) - 862 - 0401
Durham, NH 03824 fax : (603) - 862 - 4181
More information about the Gdb
mailing list