*** COMPILATION FAILED *** Failures on RHEL-s390x-m64, branch master *** BREAKAGE ***
sergiodj+buildbot@sergiodj.net
sergiodj+buildbot@sergiodj.net
Thu May 3 03:17:00 GMT 2018
Buildslave:
rhel-7_1-s390x-1
Full Build URL:
<http://gdb-build.sergiodj.net/builders/RHEL-s390x-m64/builds/7053>
Commit(s) tested:
d9f719f1adb653ab40a55e4c1b8c300215b400ff
Author(s) (in the same order as the commits):
Pedro Alves <palves@redhat.com>
Subject:
target factories, target open and multiple instances of targets
Testsuite log (gdb.sum and gdb.log) URL(s):
<http://gdb-build.sergiodj.net/results/RHEL-s390x-m64/d9/d9f719f1adb653ab40a55e4c1b8c300215b400ff/>
*** Failed to compiled GDB. ***
============================
+++ The full log is too big to be posted here.
+++ These are the last 100 lines of it.
CXX maint.o
CXX mdebugread.o
CXX mem-break.o
CXX memattr.o
CXX memory-map.o
CXX memrange.o
CXX minidebug.o
CXX minsyms.o
CXX mipsread.o
CXX namespace.o
CXX objc-lang.o
CXX objfiles.o
CXX observable.o
CXX opencl-lang.o
CXX osabi.o
CXX osdata.o
CXX p-lang.o
CXX p-typeprint.o
CXX p-valprint.o
CXX parse.o
CXX printcmd.o
CXX probe.o
CXX producer.o
CXX progspace.o
CXX progspace-and-thread.o
CXX prologue-value.o
CXX psymtab.o
CXX record.o
CXX record-btrace.o
CXX record-full.o
CXX regcache.o
CXX regcache-dump.o
CXX reggroups.o
CXX registry.o
CXX remote.o
CXX remote-fileio.o
CXX remote-notif.o
CXX reverse.o
CXX rust-lang.o
CXX sentinel-frame.o
CXX ser-event.o
CXX serial.o
CXX skip.o
CXX solib.o
CXX solib-target.o
CXX source.o
CXX stabsread.o
CXX stack.o
CXX std-regs.o
CXX symfile.o
CXX symfile-debug.o
CXX symmisc.o
CXX symtab.o
CXX target.o
CXX target-dcache.o
CXX target-descriptions.o
CXX target-memory.o
CXX thread.o
CXX thread-fsm.o
CXX tid-parse.o
CXX top.o
CXX tracefile.o
CXX tracefile-tfile.o
CXX tracepoint.o
CXX trad-frame.o
CXX tramp-frame.o
CXX target-float.o
CXX typeprint.o
CXX ui-file.o
CXX ui-out.o
CXX user-regs.o
CXX utils.o
CXX valarith.o
CXX valops.o
CXX valprint.o
CXX value.o
CXX varobj.o
CXX xml-support.o
CXX xml-syscall.o
CXX xml-tdesc.o
CXX target/waitstatus.o
CXX compile/compile.o
CXX compile/compile-c-support.o
CXX compile/compile-c-symbols.o
CXX compile/compile-c-types.o
CXX compile/compile-loc2c.o
CXX compile/compile-object-load.o
CXX compile/compile-object-run.o
CXX inflow.o
GEN init.c
CXX init.o
CXXLD gdb
s390-linux-nat.o:(.rodata._ZTV21s390_linux_nat_target[_ZTV21s390_linux_nat_target]+0x120): undefined reference to `s390_linux_nat_target::watchpoint_addr_within_range(unsigned long, unsigned long, int)'
collect2: error: ld returned 1 exit status
make[2]: *** [gdb] Error 1
make[2]: Leaving directory `/home/dje/rhel-7_1-s390x-1/rhel-s390x/build/gdb'
make[1]: *** [all-gdb] Error 2
make[1]: Leaving directory `/home/dje/rhel-7_1-s390x-1/rhel-s390x/build'
make: *** [all] Error 2
============================
More information about the Gdb-testers
mailing list