*** COMPILATION FAILED *** Failures on NetBSD-x86_64-m64, branch master *** BREAKAGE ***

sergiodj+buildbot@sergiodj.net sergiodj+buildbot@sergiodj.net
Mon Apr 16 12:13:00 GMT 2018


Buildslave:
	gdb-amd64-netbsd7

Full Build URL:
	<http://gdb-build.sergiodj.net/builders/NetBSD-x86_64-m64/builds/4179>

Commit(s) tested:
	e9af4700bc7435e593dd74d4d2e099b3d7c01eb6

Author(s) (in the same order as the commits):
	Nick Clifton <nickc@redhat.com>

Subject:
	Prevent an illegal memory access via an out of range fixup pointer.

Testsuite log (gdb.sum and gdb.log) URL(s):
	<http://gdb-build.sergiodj.net/results/NetBSD-x86_64-m64/e9/e9af4700bc7435e593dd74d4d2e099b3d7c01eb6/>

*** Failed to compiled GDB.  ***
============================

+++ The full log is too big to be posted here.
+++ These are the last 100 lines of it.

  CXX    dwarf-index-write.o
  CXX    dwarf2-frame.o
  CXX    dwarf2-frame-tailcall.o
  CXX    dwarf2expr.o
  CXX    dwarf2loc.o
  CXX    dwarf2read.o
  CXX    eval.o
  CXX    event-loop.o
  CXX    event-top.o
  CXX    exceptions.o
  CXX    expprint.o
  CXX    extension.o
  CXX    f-lang.o
  CXX    f-typeprint.o
  CXX    f-valprint.o
  CXX    filename-seen-cache.o
  CXX    filesystem.o
  CXX    findcmd.o
  CXX    findvar.o
  CXX    frame.o
  CXX    frame-base.o
  CXX    frame-unwind.o
  CXX    gcore.o
  CXX    gdb_bfd.o
  CXX    gdb-dlfcn.o
  CXX    gdb_obstack.o
  CXX    gdb_regex.o
  CXX    gdb_usleep.o
  CXX    gdbarch.o
  CXX    gdbarch-selftests.o
  CXX    gdbtypes.o
  CXX    gnu-v2-abi.o
  CXX    gnu-v3-abi.o
  CXX    go-lang.o
  CXX    go-typeprint.o
  CXX    go-valprint.o
  CXX    inf-child.o
  CXX    inf-loop.o
  CXX    infcall.o
  CXX    infcmd.o
  CXX    inferior.o
  CXX    infrun.o
  CXX    inline-frame.o
  CXX    interps.o
  CXX    jit.o
  CXX    language.o
  CXX    linespec.o
  CXX    location.o
  CXX    m2-lang.o
  CXX    m2-typeprint.o
  CXX    m2-valprint.o
  CXX    macrocmd.o
  CXX    macroexp.o
  CXX    macroscope.o
  CXX    macrotab.o
  CXX    main.o
  CXX    maint.o
  CXX    mdebugread.o
  CXX    mem-break.o
  CXX    memattr.o
  CXX    memory-map.o
  CXX    memrange.o
  CXX    minidebug.o
  CXX    minsyms.o
  CXX    mipsread.o
  CXX    namespace.o
  CXX    objc-lang.o
  CXX    objfiles.o
  CXX    observable.o
  CXX    opencl-lang.o
  CXX    osabi.o
  CXX    osdata.o
  CXX    p-lang.o
  CXX    p-typeprint.o
  CXX    p-valprint.o
  CXX    parse.o
  CXX    printcmd.o
  CXX    probe.o
  CXX    producer.o
  CXX    progspace.o
  CXX    progspace-and-thread.o
  CXX    prologue-value.o
  CXX    psymtab.o
  CXX    record.o
  CXX    record-btrace.o
  CXX    record-full.o
  CXX    regcache.o
../../binutils-gdb/gdb/regcache.c: In function 'void selftests::cooked_write_test(gdbarch*)':
../../binutils-gdb/gdb/regcache.c:1791:52: error: 'bfd_mach_sh5' was not declared in this scope
        && gdbarch_bfd_arch_info (gdbarch)->mach == bfd_mach_sh5
                                                    ^
Makefile:1612: recipe for target 'regcache.o' failed
gmake[2]: *** [regcache.o] Error 1
gmake[2]: Leaving directory '/home/motusgdb/motus/netbsd-x86_64/build/gdb'
Makefile:8791: recipe for target 'all-gdb' failed
gmake[1]: *** [all-gdb] Error 2
gmake[1]: Leaving directory '/home/motusgdb/motus/netbsd-x86_64/build'
Makefile:848: recipe for target 'all' failed
gmake: *** [all] Error 2
============================





More information about the Gdb-testers mailing list