*** COMPILATION FAILED *** Failures on NetBSD-x86_64-m64, branch master *** BREAKAGE ***
sergiodj+buildbot@sergiodj.net
sergiodj+buildbot@sergiodj.net
Fri Apr 13 08:59:00 GMT 2018
Buildslave:
gdb-amd64-netbsd7
Full Build URL:
<http://gdb-build.sergiodj.net/builders/NetBSD-x86_64-m64/builds/4150>
Commit(s) tested:
1d509aa625f891e20b37b8cee4659771e87b1ba4
Author(s) (in the same order as the commits):
Markus Metzger <markus.t.metzger@intel.com>
Subject:
infrun: step through indirect branch thunks
Testsuite log (gdb.sum and gdb.log) URL(s):
<http://gdb-build.sergiodj.net/results/NetBSD-x86_64-m64/1d/1d509aa625f891e20b37b8cee4659771e87b1ba4/>
*** Failed to compiled GDB. ***
============================
+++ The full log is too big to be posted here.
+++ These are the last 100 lines of it.
CXX memrange.o
CXX minidebug.o
CXX minsyms.o
CXX mipsread.o
CXX namespace.o
CXX objc-lang.o
CXX objfiles.o
CXX observable.o
CXX opencl-lang.o
CXX osabi.o
CXX osdata.o
CXX p-lang.o
CXX p-typeprint.o
CXX p-valprint.o
CXX parse.o
CXX printcmd.o
CXX probe.o
CXX producer.o
CXX progspace.o
CXX progspace-and-thread.o
CXX prologue-value.o
CXX psymtab.o
CXX record.o
CXX record-btrace.o
CXX record-full.o
CXX regcache.o
CXX regcache-dump.o
CXX reggroups.o
CXX registry.o
CXX remote.o
CXX remote-fileio.o
CXX remote-notif.o
CXX reverse.o
CXX rust-lang.o
CXX sentinel-frame.o
CXX ser-event.o
CXX serial.o
CXX skip.o
CXX solib.o
CXX solib-target.o
CXX source.o
CXX stabsread.o
CXX stack.o
CXX std-regs.o
CXX symfile.o
CXX symfile-debug.o
CXX symmisc.o
CXX symtab.o
CXX target.o
CXX target-dcache.o
CXX target-descriptions.o
CXX target-memory.o
CXX thread.o
CXX thread-fsm.o
CXX tid-parse.o
CXX top.o
CXX tracefile.o
CXX tracefile-tfile.o
CXX tracepoint.o
CXX trad-frame.o
CXX tramp-frame.o
CXX target-float.o
CXX typeprint.o
CXX ui-file.o
CXX ui-out.o
CXX user-regs.o
CXX utils.o
CXX valarith.o
CXX valops.o
CXX valprint.o
CXX value.o
CXX varobj.o
CXX xml-support.o
CXX xml-syscall.o
CXX xml-tdesc.o
CXX target/waitstatus.o
CXX compile/compile.o
CXX compile/compile-c-support.o
CXX compile/compile-c-symbols.o
CXX compile/compile-c-types.o
CXX compile/compile-loc2c.o
CXX compile/compile-object-load.o
CXX compile/compile-object-run.o
CXX inflow.o
GEN init.c
CXX init.o
CXXLD gdb
i386-tdep.o: In function `i386_in_indirect_branch_thunk(gdbarch*, unsigned long)':
i386-tdep.c:(.text+0x7c82): undefined reference to `x86_in_indirect_branch_thunk(unsigned long, char const**, int, int)'
amd64-tdep.o: In function `amd64_in_indirect_branch_thunk(gdbarch*, unsigned long)':
amd64-tdep.c:(.text+0x4e3d): undefined reference to `x86_in_indirect_branch_thunk(unsigned long, char const**, int, int)'
Makefile:1911: recipe for target 'gdb' failed
gmake[2]: *** [gdb] Error 1
gmake[2]: Leaving directory '/home/motusgdb/motus/netbsd-x86_64/build/gdb'
Makefile:8791: recipe for target 'all-gdb' failed
gmake[1]: *** [all-gdb] Error 2
gmake[1]: Leaving directory '/home/motusgdb/motus/netbsd-x86_64/build'
Makefile:848: recipe for target 'all' failed
gmake: *** [all] Error 2
============================
More information about the Gdb-testers
mailing list