Breakage on builder Fedora-x86_64-m64, revision fa4dc567aec7664b3508dd9401b1fbb6d304f281

gdb-buildbot@sergiodj.net gdb-buildbot@sergiodj.net
Wed Aug 21 11:49:00 GMT 2019


Unfortunately it seems that there is a breakage on GDB.

Commit title: 'Remove indirection from tui_data_window::regs_content'
Revision: fa4dc567aec7664b3508dd9401b1fbb6d304f281

You can find more details below:

+-+-+-+-+-+-+-+-+-+-+-+-+-+-+-+-+-+-+-+


+++ The full log is too big to be posted here.
+++ These are the last 100 lines of it.

  CXX    solib-darwin.o
  CXX    solib-dsbt.o
  CXX    solib-frv.o
  CXX    solib-spu.o
  CXX    solib-svr4.o
  CXX    solib-target.o
  CXX    solib.o
  CXX    source-cache.o
  CXX    source.o
  CXX    sparc-linux-tdep.o
  CXX    sparc-nbsd-tdep.o
  CXX    sparc-obsd-tdep.o
  CXX    sparc-ravenscar-thread.o
  CXX    sparc-sol2-tdep.o
  CXX    sparc-tdep.o
  CXX    sparc64-fbsd-tdep.o
  CXX    sparc64-linux-tdep.o
  CXX    sparc64-nbsd-tdep.o
  CXX    sparc64-obsd-tdep.o
  CXX    sparc64-sol2-tdep.o
  CXX    sparc64-tdep.o
  CXX    spu-multiarch.o
  CXX    spu-tdep.o
  CXX    stabsread.o
  CXX    stack.o
  CXX    stap-probe.o
  CXX    std-regs.o
  CXX    symfile-debug.o
  CXX    symfile-mem.o
  CXX    symfile.o
  CXX    symmisc.o
  CXX    symtab.o
  CXX    target-dcache.o
  CXX    target-descriptions.o
  CXX    target-float.o
  CXX    target-memory.o
  CXX    target.o
  CXX    target/waitstatus.o
  CXX    test-target.o
  CXX    thread-iter.o
  CXX    thread.o
  CXX    tic6x-linux-tdep.o
  CXX    tic6x-tdep.o
  CXX    tid-parse.o
  CXX    tilegx-linux-tdep.o
  CXX    tilegx-tdep.o
  CXX    top.o
  CXX    tracefile-tfile.o
  CXX    tracefile.o
  CXX    tracepoint.o
  CXX    trad-frame.o
  CXX    tramp-frame.o
  CXX    tui/tui-command.o
  CXX    tui/tui-data.o
  CXX    tui/tui-disasm.o
  CXX    tui/tui-file.o
  CXX    tui/tui-hooks.o
  CXX    tui/tui-interp.o
  CXX    tui/tui-io.o
  CXX    tui/tui-layout.o
  CXX    tui/tui-out.o
  CXX    tui/tui-regs.o
  CXX    tui/tui-source.o
  CXX    tui/tui-stack.o
  CXX    tui/tui-win.o
In file included from ../../binutils-gdb/gdb/tui/tui-regs.c:37:
../../binutils-gdb/gdb/tui/tui-regs.h: In instantiation of void std::_Construct(_T1*, _Args&& ...) [with _T1 = tui_data_item_window; _Args = {tui_data_item_window}]:
/usr/include/c++/9/bits/stl_uninitialized.h:83:18:   required from static _ForwardIterator std::__uninitialized_copy<_TrivialValueTypes>::__uninit_copy(_InputIterator, _InputIterator, _ForwardIterator) [with _InputIterator = std::move_iterator<tui_data_item_window*>; _ForwardIterator = tui_data_item_window*; bool _TrivialValueTypes = false]
/usr/include/c++/9/bits/stl_uninitialized.h:134:15:   required from _ForwardIterator std::uninitialized_copy(_InputIterator, _InputIterator, _ForwardIterator) [with _InputIterator = std::move_iterator<tui_data_item_window*>; _ForwardIterator = tui_data_item_window*]
/usr/include/c++/9/bits/stl_uninitialized.h:289:37:   required from _ForwardIterator std::__uninitialized_copy_a(_InputIterator, _InputIterator, _ForwardIterator, std::allocator<_Tp>&) [with _InputIterator = std::move_iterator<tui_data_item_window*>; _ForwardIterator = tui_data_item_window*; _Tp = tui_data_item_window]
/usr/include/c++/9/bits/stl_uninitialized.h:311:2:   required from _ForwardIterator std::__uninitialized_move_if_noexcept_a(_InputIterator, _InputIterator, _ForwardIterator, _Allocator&) [with _InputIterator = tui_data_item_window*; _ForwardIterator = tui_data_item_window*; _Allocator = std::allocator<tui_data_item_window>]
/usr/include/c++/9/bits/vector.tcc:659:48:   required from void std::__cxx1998::vector<_Tp, _Alloc>::_M_default_append(std::__cxx1998::vector<_Tp, _Alloc>::size_type) [with _Tp = tui_data_item_window; _Alloc = std::allocator<tui_data_item_window>; std::__cxx1998::vector<_Tp, _Alloc>::size_type = long unsigned int]
/usr/include/c++/9/bits/stl_vector.h:937:4:   required from void std::__cxx1998::vector<_Tp, _Alloc>::resize(std::__cxx1998::vector<_Tp, _Alloc>::size_type) [with _Tp = tui_data_item_window; _Alloc = std::allocator<tui_data_item_window>; std::__cxx1998::vector<_Tp, _Alloc>::size_type = long unsigned int]
/usr/include/c++/9/debug/vector:357:15:   required from void std::__debug::vector<_Tp, _Allocator>::resize(std::__debug::vector<_Tp, _Allocator>::size_type) [with _Tp = tui_data_item_window; _Allocator = std::allocator<tui_data_item_window>; std::__debug::vector<_Tp, _Allocator>::size_type = long unsigned int]
../../binutils-gdb/gdb/tui/tui-regs.c:214:31:   required from here
../../binutils-gdb/gdb/tui/tui-regs.h:38:3: error: implicitly-declared constexpr tui_gen_win_info::tui_gen_win_info(const tui_gen_win_info&) is deprecated [-Werror=deprecated-copy-dtor]
   38 |   tui_data_item_window (tui_data_item_window &&) = default;
      |   ^~~~~~~~~~~~~~~~~~~~
In file included from ../../binutils-gdb/gdb/tui/tui-regs.c:25:
../../binutils-gdb/gdb/tui/tui-data.h:57:11: note: because tui_gen_win_info has user-provided virtual tui_gen_win_info::~tui_gen_win_info()
   57 |   virtual ~tui_gen_win_info ();
      |           ^
In file included from /usr/include/c++/9/vector:65,
                 from ../../binutils-gdb/gdb/gdbsupport/common-utils.h:24,
                 from ../../binutils-gdb/gdb/gdbsupport/common-defs.h:122,
                 from ../../binutils-gdb/gdb/defs.h:28,
                 from ../../binutils-gdb/gdb/tui/tui-regs.c:22:
/usr/include/c++/9/bits/stl_construct.h:75:7: note: synthesized method tui_data_item_window::tui_data_item_window(tui_data_item_window&&) first required here
   75 |     { ::new(static_cast<void*>(__p)) _T1(std::forward<_Args>(__args)...); }
      |       ^~~~~~~~~~~~~~~~~~~~~~~~~~~~~~~~~~~~~~~~~~~~~~~~~~~~~~~~~~~~~~~~~~
cc1plus: all warnings being treated as errors
make[2]: *** [Makefile:1638: tui/tui-regs.o] Error 1
make[2]: *** Waiting for unfinished jobs....
make[2]: Leaving directory '/home/gdb-buildbot-2/fedora-x86-64-4/fedora-x86-64/build/gdb'
make[1]: *** [Makefile:9230: all-gdb] Error 2
make: *** [Makefile:852: all] Error 2
make[1]: Leaving directory '/home/gdb-buildbot-2/fedora-x86-64-4/fedora-x86-64/build'
program finished with exit code 2
elapsedTime=834.051250



More information about the Gdb-patches mailing list