[Bug general/24498] 0.176: isn't LTO ready

kloczko.tomasz at gmail dot com sourceware-bugzilla@sourceware.org
Wed May 6 15:23:26 GMT 2020


https://sourceware.org/bugzilla/show_bug.cgi?id=24498

--- Comment #20 from kloczek <kloczko.tomasz at gmail dot com> ---
Just tretested using latest binutils and gcc and looksl like it compiles and
links correctly.

Despite that test suite is not possing:

/usr/bin/make  check-TESTS
PASS: newfile
PASS: update1
FAIL: test-nlist
PASS: update2
PASS: newscn
PASS: hash
PASS: update4
PASS: update3
PASS: run-get-aranges.sh
PASS: run-show-abbrev.sh
PASS: run-ecp-test.sh
PASS: run-ecp-test2.sh
PASS: run-get-pubnames.sh
PASS: run-unstrip-M.sh
PASS: run-get-lines.sh
PASS: run-ranlib-test.sh
PASS: run-alldts.sh
PASS: run-ranlib-test2.sh
PASS: run-ar.sh
PASS: run-show-die-info.sh
PASS: run-allfcts.sh
PASS: run-ranlib-test3.sh
PASS: run-strip-groups.sh
PASS: run-unstrip-test2.sh
PASS: run-next-lines.sh
PASS: run-unstrip-test.sh
PASS: run-unstrip-test3.sh
PASS: run-elfstrmerge-test.sh
PASS: run-get-files.sh
PASS: run-ranlib-test4.sh
PASS: run-next-files.sh
PASS: run-line2addr.sh
PASS: run-unstrip-test4.sh
PASS: run-funcscopes.sh
PASS: run-addrscopes.sh
PASS: run-readelf-const-values.sh
PASS: run-strip-test3.sh
PASS: run-readelf-info-plus.sh
FAIL: run-elflint-self.sh
PASS: run-readelf-test1.sh
PASS: run-strip-test11.sh
PASS: run-strings-test.sh
PASS: run-readelf-test3.sh
PASS: run-strip-test2.sh
PASS: run-strip-test12.sh
PASS: run-strip-nobitsalign.sh
PASS: run-readelf-test4.sh
FAIL: run-strip-strmerge.sh
PASS: run-strip-test9.sh
PASS: run-readelf-macro.sh
PASS: run-strip-test.sh
PASS: run-readelf-compressed.sh
PASS: run-strip-nothing.sh
PASS: run-readelf-test2.sh
PASS: run-readelf-twofiles.sh
PASS: dwfl-bug-addr-overflow
PASS: dwfl-bug-report
PASS: run-strip-test10.sh
PASS: run-readelf-aranges.sh
PASS: dwfl-report-segment-contiguous
PASS: run-strip-test4.sh
PASS: run-strip-test7.sh
PASS: run-strip-test5.sh
PASS: run-strip-test6.sh
PASS: run-strip-test8.sh
PASS: run-strip-g.sh
PASS: run-early-offscn.sh
PASS: run-debuglink.sh
PASS: run-dwfl-bug-offline-rel.sh
PASS: run-test-flag-nobits.sh
PASS: run-debugaltlink.sh
PASS: run-elflint-test.sh
PASS: run-bug1-test.sh
FAIL: run-varlocs-self.sh
PASS: run-buildid.sh
PASS: run-dwarf-getstring.sh
PASS: run-dwfl-addr-sect.sh
PASS: run-elf_cntl_gelf_getshdr.sh
PASS: run-dwarfcfi.sh
PASS: run-readelf-d.sh
FAIL: run-exprlocs-self.sh
PASS: run-rerequest_tag.sh
PASS: run-disasm-x86.sh
PASS: run-disasm-x86-64.sh
PASS: run-readelf-vmcoreinfo.sh
PASS: run-readelf-gdb_index.sh
PASS: run-find-prologues.sh
PASS: run-typeiter.sh
PASS: run-dwfl-report-elf-align.sh
PASS: run-macro-test.sh
PASS: run-readelf-variant.sh
PASS: run-test-archive64.sh
PASS: run-addr2line-i-demangle-test.sh
PASS: run-dwarf-getmacros.sh
PASS: run-addrcfi.sh
PASS: run-annobingroup.sh
PASS: run-readelf-line.sh
PASS: run-exprlocs.sh
PASS: run-funcretval.sh
PASS: run-unstrip-n.sh
PASS: run-readelf-z.sh
PASS: run-dwarf-ranges.sh
PASS: run-readelf-ranges.sh
PASS: run-backtrace-dwarf.sh
PASS: run-readelf-n.sh
PASS: run-addr2line-alt-debugpath.sh
PASS: run-readelf-loc.sh
PASS: run-backtrace-native.sh
PASS: run-backtrace-data.sh
PASS: run-backtrace-native-biarch.sh
PASS: run-addr2line-i-lex-test.sh
PASS: run-backtrace-demangle.sh
PASS: run-readelf-zp.sh
PASS: run-backtrace-core-x86_64.sh
PASS: run-backtrace-fp-core-x86_64.sh
PASS: run-backtrace-fp-core-aarch64.sh
PASS: vdsosyms
PASS: run-backtrace-fp-core-ppc64le.sh
PASS: run-stack-i-test.sh
PASS: run-dwfllines.sh
PASS: run-backtrace-core-x32.sh
PASS: run-backtrace-fp-core-i386.sh
PASS: run-readelf-types.sh
PASS: run-backtrace-core-i386.sh
PASS: run-backtrace-core-ppc.sh
PASS: run-backtrace-core-aarch64.sh
PASS: run-backtrace-core-s390.sh
PASS: run-readelf-addr.sh
PASS: run-low_high_pc.sh
PASS: newdata
PASS: elfstrtab
PASS: run-backtrace-core-sparc.sh
PASS: elfshphehdr
PASS: run-backtrace-core-s390x.sh
PASS: dwfl-proc-attach
PASS: run-native-test.sh
PASS: run-readelf-str.sh
PASS: run-readelf-mixed-corenote.sh
PASS: run-stack-d-test.sh
PASS: run-linkmap-cut.sh
PASS: run-addr2line-test.sh
PASS: run-readelf-zx.sh
PASS: emptyfile
PASS: vendorelf
PASS: run-strptr.sh
SKIP: run-lfs-symbols.sh
PASS: fillfile
PASS: dwarf_default_lower_bound
PASS: run-stack-demangled-test.sh
PASS: run-peel-type.sh
PASS: run-allregs.sh
PASS: run-zstrptr.sh
PASS: run-aggregate-size.sh
PASS: run-allfcts-multi.sh
PASS: run-getsrc-die.sh
PASS: run-addr2line-i-test.sh
PASS: run-addrname-test.sh
PASS: run-reloc-bpf.sh
PASS: run-readelf-A.sh
PASS: run-varlocs.sh
PASS: run-elfputzdata.sh
PASS: msg_tst
PASS: run-readelf-dwz-multi.sh
PASS: run-all-dwarf-ranges.sh
PASS: run-readelf-discr.sh
PASS: run-dwelfgnucompressed.sh
PASS: system-elf-libelf-test
PASS: run-attr-integrate-skel.sh
PASS: asm-tst1
PASS: asm-tst2
PASS: run-strip-version.sh
PASS: run-disasm-riscv64.sh
PASS: asm-tst3
PASS: dwfl-bug-fd-leak
PASS: asm-tst7
PASS: run-dwelf_elf_e_machine_string.sh
PASS: asm-tst8
PASS: asm-tst9
PASS: run-elfgetzdata.sh
PASS: run-getphdrnum.sh
PASS: run-xlate-note.sh
PASS: run-deleted.sh
PASS: run-next-cfi-self.sh
PASS: run-next-cfi.sh
PASS: run-pt_gnu_prop-tests.sh
PASS: run-elfgetchdr.sh
PASS: run-disasm-bpf.sh
PASS: asm-tst4
PASS: asm-tst6
FAIL: run-get-units-invalid.sh
PASS: run-strip-remove-keep.sh
PASS: run-typeiter-many.sh
PASS: run-unit-info.sh
PASS: run-get-units-split.sh
PASS: asm-tst5
PASS: run-prelink-addr-test.sh
FAIL: run-dwarf-die-addr-die.sh
PASS: run-readelf-zdebug.sh
PASS: run-readelf-zdebug-rel.sh
PASS: run-readelf-s.sh
FAIL: run-reverse-sections-self.sh
PASS: run-reverse-sections.sh
PASS: run-backtrace-native-core.sh
PASS: run-dwflsyms.sh
PASS: run-elfclassify-self.sh
PASS: run-copyadd-sections.sh
PASS: run-arextract.sh
FAIL: run-readelf-self.sh
PASS: run-nm-self.sh
PASS: run-strip-test-many.sh
PASS: run-backtrace-native-core-biarch.sh
PASS: run-elfclassify.sh
PASS: run-compress-test.sh
PASS: run-arsymtest.sh
PASS: run-debuginfod-find.sh
PASS: run-copymany-sections.sh
FAIL: run-strip-reloc.sh
PASS: run-large-elf-file.sh
==========================================
   elfutils 0.179: tests/test-suite.log
==========================================

# TOTAL: 218
# PASS:  207
# SKIP:  1
# XFAIL: 0
# FAIL:  10
# XPASS: 0
# ERROR: 0

.. contents:: :depth: 2

FAIL: test-nlist
================

FAIL test-nlist (exit status: 1)

FAIL: run-strip-reloc.sh
========================

runtest hello_i386.ko
runtest hello_x86_64.ko
runtest hello_ppc64.ko
runtest hello_s390.ko
runtest hello_aarch64.ko
runtest hello_m68k.ko
runtest hello_riscv64.ko
runtest hello_csky.ko
runtest /home/tkloczko/rpmbuild/BUILD/elfutils-0.179/src/strip
runtest /home/tkloczko/rpmbuild/BUILD/elfutils-0.179/src/strip.o
*** failure --reloc-debug-sections not smaller
/home/tkloczko/rpmbuild/BUILD/elfutils-0.179/src/strip.o
/home/tkloczko/rpmbuild/BUILD/elfutils-0.179/src/readelf: cannot get debug
context descriptor: No DWARF information found
*** failure readelf -w debugfile1
/home/tkloczko/rpmbuild/BUILD/elfutils-0.179/src/strip.o
/home/tkloczko/rpmbuild/BUILD/elfutils-0.179/src/readelf: cannot get debug
context descriptor: No DWARF information found
*** failure readelf -w debugfile2
/home/tkloczko/rpmbuild/BUILD/elfutils-0.179/src/strip.o
runtest strip-uncompressed.o
*** failure --reloc-debug-sections not smaller strip-uncompressed.o
/home/tkloczko/rpmbuild/BUILD/elfutils-0.179/src/readelf: cannot get debug
context descriptor: No DWARF information found
*** failure readelf -w debugfile1 strip-uncompressed.o
/home/tkloczko/rpmbuild/BUILD/elfutils-0.179/src/readelf: cannot get debug
context descriptor: No DWARF information found
*** failure readelf -w debugfile2 strip-uncompressed.o
runtest strip-compressed.o
*** failure --reloc-debug-sections not smaller strip-compressed.o
/home/tkloczko/rpmbuild/BUILD/elfutils-0.179/src/readelf: cannot get debug
context descriptor: No DWARF information found
*** failure readelf -w debugfile1 strip-compressed.o
/home/tkloczko/rpmbuild/BUILD/elfutils-0.179/src/readelf: cannot get debug
context descriptor: No DWARF information found
*** failure readelf -w debugfile2 strip-compressed.o
runtest testfile-debug-rel-ppc64.o
runtest testfile-debug-rel-ppc64-z.o
runtest testfile-debug-rel-ppc64-g.o
FAIL run-strip-reloc.sh (exit status: 1)

FAIL: run-strip-strmerge.sh
===========================

elflint /home/tkloczko/rpmbuild/BUILD/elfutils-0.179/tests/elfstrmerge
No errors
elfstrmerge
elflint merged.elf
No errors
strip
elflint merged.elf.stripped
No errors
elflint merged.elf.debug
No errors
unstrip
elflint remerged.elf
No errors
elfcmp
elflint /home/tkloczko/rpmbuild/BUILD/elfutils-0.179/tests/elfstrmerge.o
section [22] '.gnu.debuglto_.debug_info' contains invalid processor-specific
flag(s) 0x80000000
section [24] '.gnu.debuglto_.debug_abbrev' contains invalid processor-specific
flag(s) 0x80000000
section [25] '.gnu.debuglto_.debug_line' contains invalid processor-specific
flag(s) 0x80000000
section [26] '.gnu.debuglto_.debug_str' contains invalid processor-specific
flag(s) 0x80000000
section [27] '.gnu.lto_.profile.8515d26d9a2b5d72' contains invalid
processor-specific flag(s) 0x80000000
section [28] '.gnu.lto_.icf.8515d26d9a2b5d72' contains invalid
processor-specific flag(s) 0x80000000
section [29] '.gnu.lto_.jmpfuncs.8515d26d9a2b5d72' contains invalid
processor-specific flag(s) 0x80000000
section [30] '.gnu.lto_.ipa_sra.8515d26d9a2b5d72' contains invalid
processor-specific flag(s) 0x80000000
section [31] '.gnu.lto_.inline.8515d26d9a2b5d72' contains invalid
processor-specific flag(s) 0x80000000
section [32] '.gnu.lto_.pureconst.8515d26d9a2b5d72' contains invalid
processor-specific flag(s) 0x80000000
section [33] '.gnu.lto_.lto.8515d26d9a2b5d72' contains invalid
processor-specific flag(s) 0x80000000
section [34] '.gnu.lto_newstrtabdata.106.8515d26d9a2b5d72' contains invalid
processor-specific flag(s) 0x80000000
section [35] '.gnu.lto_release.109.8515d26d9a2b5d72' contains invalid
processor-specific flag(s) 0x80000000
section [36] '.gnu.lto_fail.110.8515d26d9a2b5d72' contains invalid
processor-specific flag(s) 0x80000000
section [37] '.gnu.lto_fail_errno.111.8515d26d9a2b5d72' contains invalid
processor-specific flag(s) 0x80000000
section [38] '.gnu.lto_fail_idx.112.8515d26d9a2b5d72' contains invalid
processor-specific flag(s) 0x80000000
section [39] '.gnu.lto_fail_elf.113.8515d26d9a2b5d72' contains invalid
processor-specific flag(s) 0x80000000
section [40] '.gnu.lto_fail_elf_idx.114.8515d26d9a2b5d72' contains invalid
processor-specific flag(s) 0x80000000
section [41] '.gnu.lto_newsecndx.1.115.8515d26d9a2b5d72' contains invalid
processor-specific flag(s) 0x80000000
section [42] '.gnu.lto_main.116.8515d26d9a2b5d72' contains invalid
processor-specific flag(s) 0x80000000
section [43] '.gnu.lto_new_data_buf.0.117.8515d26d9a2b5d72' contains invalid
processor-specific flag(s) 0x80000000
section [44] '.gnu.lto_.symbol_nodes.8515d26d9a2b5d72' contains invalid
processor-specific flag(s) 0x80000000
section [45] '.gnu.lto_.refs.8515d26d9a2b5d72' contains invalid
processor-specific flag(s) 0x80000000
section [46] '.gnu.lto_.decls.8515d26d9a2b5d72' contains invalid
processor-specific flag(s) 0x80000000
section [47] '.gnu.lto_.symtab.8515d26d9a2b5d72' contains invalid
processor-specific flag(s) 0x80000000
section [48] '.gnu.lto_.ext_symtab.8515d26d9a2b5d72' contains invalid
processor-specific flag(s) 0x80000000
section [49] '.gnu.lto_.opts' contains invalid processor-specific flag(s)
0x80000000
FAIL run-strip-strmerge.sh (exit status: 1)

FAIL: run-elflint-self.sh
=========================

section [22] '.gnu.debuglto_.debug_info' contains invalid processor-specific
flag(s) 0x80000000
section [24] '.gnu.debuglto_.debug_abbrev' contains invalid processor-specific
flag(s) 0x80000000
section [25] '.gnu.debuglto_.debug_line' contains invalid processor-specific
flag(s) 0x80000000
section [26] '.gnu.debuglto_.debug_str' contains invalid processor-specific
flag(s) 0x80000000
section [27] '.gnu.lto_.profile.983b015b3c475f2b' contains invalid
processor-specific flag(s) 0x80000000
section [28] '.gnu.lto_.icf.983b015b3c475f2b' contains invalid
processor-specific flag(s) 0x80000000
section [29] '.gnu.lto_.jmpfuncs.983b015b3c475f2b' contains invalid
processor-specific flag(s) 0x80000000
section [30] '.gnu.lto_.ipa_sra.983b015b3c475f2b' contains invalid
processor-specific flag(s) 0x80000000
section [31] '.gnu.lto_.inline.983b015b3c475f2b' contains invalid
processor-specific flag(s) 0x80000000
section [32] '.gnu.lto_.pureconst.983b015b3c475f2b' contains invalid
processor-specific flag(s) 0x80000000
section [33] '.gnu.lto_.lto.983b015b3c475f2b' contains invalid
processor-specific flag(s) 0x80000000
section [34] '.gnu.lto_argp_program_version_hook.90.983b015b3c475f2b' contains
invalid processor-specific flag(s) 0x80000000
section [35] '.gnu.lto_argp_program_bug_address.91.983b015b3c475f2b' contains
invalid processor-specific flag(s) 0x80000000
section [36] '.gnu.lto_options.92.983b015b3c475f2b' contains invalid
processor-specific flag(s) 0x80000000
section [37] '.gnu.lto_doc.93.983b015b3c475f2b' contains invalid
processor-specific flag(s) 0x80000000
section [38] '.gnu.lto_argp.95.983b015b3c475f2b' contains invalid
processor-specific flag(s) 0x80000000
section [39] '.gnu.lto_length_map.98.983b015b3c475f2b' contains invalid
processor-specific flag(s) 0x80000000
section [40] '.gnu.lto_main.101.983b015b3c475f2b' contains invalid
processor-specific flag(s) 0x80000000
section [41] '.gnu.lto_parse_opt.102.983b015b3c475f2b' contains invalid
processor-specific flag(s) 0x80000000
section [42] '.gnu.lto_process_file.103.983b015b3c475f2b' contains invalid
processor-specific flag(s) 0x80000000
section [43] '.gnu.lto_print_header.104.983b015b3c475f2b' contains invalid
processor-specific flag(s) 0x80000000
section [44] '.gnu.lto_handle_ar.105.983b015b3c475f2b' contains invalid
processor-specific flag(s) 0x80000000
section [45] '.gnu.lto_show_sysv.106.983b015b3c475f2b' contains invalid
processor-specific flag(s) 0x80000000
section [46] '.gnu.lto_show_sysv_one_line.107.983b015b3c475f2b' contains
invalid processor-specific flag(s) 0x80000000
section [47] '.gnu.lto_show_bsd.111.983b015b3c475f2b' contains invalid
processor-specific flag(s) 0x80000000
section [48] '.gnu.lto_show_bsd_totals.112.983b015b3c475f2b' contains invalid
processor-specific flag(s) 0x80000000
section [49] '.gnu.lto_show_segments.113.983b015b3c475f2b' contains invalid
processor-specific flag(s) 0x80000000
section [50] '.gnu.lto_handle_elf.114.983b015b3c475f2b' contains invalid
processor-specific flag(s) 0x80000000
section [51] '.gnu.lto_.symbol_nodes.983b015b3c475f2b' contains invalid
processor-specific flag(s) 0x80000000
section [52] '.gnu.lto_.refs.983b015b3c475f2b' contains invalid
processor-specific flag(s) 0x80000000
section [53] '.gnu.lto_.decls.983b015b3c475f2b' contains invalid
processor-specific flag(s) 0x80000000
section [54] '.gnu.lto_.symtab.983b015b3c475f2b' contains invalid
processor-specific flag(s) 0x80000000
section [55] '.gnu.lto_.ext_symtab.983b015b3c475f2b' contains invalid
processor-specific flag(s) 0x80000000
section [56] '.gnu.lto_.opts' contains invalid processor-specific flag(s)
0x80000000
*** failure in /home/tkloczko/rpmbuild/BUILD/elfutils-0.179/src/elflint --quiet
--gnu-ld /home/tkloczko/rpmbuild/BUILD/elfutils-0.179/src/size.o
section [22] '.gnu.debuglto_.debug_info' contains invalid processor-specific
flag(s) 0x80000000
section [24] '.gnu.debuglto_.debug_abbrev' contains invalid processor-specific
flag(s) 0x80000000
section [25] '.gnu.debuglto_.debug_line' contains invalid processor-specific
flag(s) 0x80000000
section [26] '.gnu.debuglto_.debug_str' contains invalid processor-specific
flag(s) 0x80000000
section [27] '.gnu.lto_.profile.b5a96fe9b515526' contains invalid
processor-specific flag(s) 0x80000000
section [28] '.gnu.lto_.icf.b5a96fe9b515526' contains invalid
processor-specific flag(s) 0x80000000
section [29] '.gnu.lto_.jmpfuncs.b5a96fe9b515526' contains invalid
processor-specific flag(s) 0x80000000
section [30] '.gnu.lto_.ipa_sra.b5a96fe9b515526' contains invalid
processor-specific flag(s) 0x80000000
section [31] '.gnu.lto_.inline.b5a96fe9b515526' contains invalid
processor-specific flag(s) 0x80000000
section [32] '.gnu.lto_.pureconst.b5a96fe9b515526' contains invalid
processor-specific flag(s) 0x80000000
section [33] '.gnu.lto_.lto.b5a96fe9b515526' contains invalid
processor-specific flag(s) 0x80000000
section [34] '.gnu.lto_pwrite_retry.95.b5a96fe9b515526' contains invalid
processor-specific flag(s) 0x80000000
section [35] '.gnu.lto_argp_program_version_hook.98.b5a96fe9b515526' contains
invalid processor-specific flag(s) 0x80000000
section [36] '.gnu.lto_argp_program_bug_address.99.b5a96fe9b515526' contains
invalid processor-specific flag(s) 0x80000000
section [37] '.gnu.lto_options.100.b5a96fe9b515526' contains invalid
processor-specific flag(s) 0x80000000
section [38] '.gnu.lto_doc.101.b5a96fe9b515526' contains invalid
processor-specific flag(s) 0x80000000
section [39] '.gnu.lto_argp.103.b5a96fe9b515526' contains invalid
processor-specific flag(s) 0x80000000
section [40] '.gnu.lto_add_pattern.118.b5a96fe9b515526' contains invalid
processor-specific flag(s) 0x80000000
section [41] '.gnu.lto_free_sec_patterns.119.b5a96fe9b515526' contains invalid
processor-specific flag(s) 0x80000000
section [42] '.gnu.lto_free_patterns.120.b5a96fe9b515526' contains invalid
processor-specific flag(s) 0x80000000
section [43] '.gnu.lto_section_name_matches.121.b5a96fe9b515526' contains
invalid processor-specific flag(s) 0x80000000
section [44] '.gnu.lto_main.122.b5a96fe9b515526' contains invalid
processor-specific flag(s) 0x80000000
section [45] '.gnu.lto_parse_opt.123.b5a96fe9b515526' contains invalid
processor-specific flag(s) 0x80000000
section [46] '.gnu.lto_secndx_name.124.b5a96fe9b515526' contains invalid
processor-specific flag(s) 0x80000000
section [47] '.gnu.lto_get_xndxdata.125.b5a96fe9b515526' contains invalid
processor-specific flag(s) 0x80000000
section [48] '.gnu.lto_update_shdrstrndx.126.b5a96fe9b515526' contains invalid
processor-specific flag(s) 0x80000000
section [49] '.gnu.lto_relocate.3.127.b5a96fe9b515526' contains invalid
processor-specific flag(s) 0x80000000
section [50] '.gnu.lto_remove_debug_relocations.128.b5a96fe9b515526' contains
invalid processor-specific flag(s) 0x80000000
section [51] '.gnu.lto_process_file.129.b5a96fe9b515526' contains invalid
processor-specific flag(s) 0x80000000
section [52] '.gnu.lto_handle_debug_relocs.130.b5a96fe9b515526' contains
invalid processor-specific flag(s) 0x80000000
section [53] '.gnu.lto_check_preserved.0.131.b5a96fe9b515526' contains invalid
processor-specific flag(s) 0x80000000
section [54] '.gnu.lto_handle_elf.132.b5a96fe9b515526' contains invalid
processor-specific flag(s) 0x80000000
section [55] '.gnu.lto_update_section_size.1.133.b5a96fe9b515526' contains
invalid processor-specific flag(s) 0x80000000
section [56] '.gnu.lto_no_symtab_updates.2.134.b5a96fe9b515526' contains
invalid processor-specific flag(s) 0x80000000
section [57] '.gnu.lto_cleanup_debug.part.0.247.b5a96fe9b515526' contains
invalid processor-specific flag(s) 0x80000000
section [58] '.gnu.lto_.symbol_nodes.b5a96fe9b515526' contains invalid
processor-specific flag(s) 0x80000000
section [59] '.gnu.lto_.refs.b5a96fe9b515526' contains invalid
processor-specific flag(s) 0x80000000
section [60] '.gnu.lto_.decls.b5a96fe9b515526' contains invalid
processor-specific flag(s) 0x80000000
section [61] '.gnu.lto_.symtab.b5a96fe9b515526' contains invalid
processor-specific flag(s) 0x80000000
section [62] '.gnu.lto_.ext_symtab.b5a96fe9b515526' contains invalid
processor-specific flag(s) 0x80000000
section [63] '.gnu.lto_.opts' contains invalid processor-specific flag(s)
0x80000000
*** failure in /home/tkloczko/rpmbuild/BUILD/elfutils-0.179/src/elflint --quiet
--gnu-ld /home/tkloczko/rpmbuild/BUILD/elfutils-0.179/src/strip.o
FAIL run-elflint-self.sh (exit status: 1)

FAIL: run-readelf-self.sh
=========================

/home/tkloczko/rpmbuild/BUILD/elfutils-0.179/src/readelf: cannot get debug
context descriptor: No DWARF information found
*** failure in /home/tkloczko/rpmbuild/BUILD/elfutils-0.179/src/readelf -a -w
/home/tkloczko/rpmbuild/BUILD/elfutils-0.179/src/size.o
/home/tkloczko/rpmbuild/BUILD/elfutils-0.179/src/readelf: cannot get debug
context descriptor: No DWARF information found
*** failure in /home/tkloczko/rpmbuild/BUILD/elfutils-0.179/src/readelf -a -w
/home/tkloczko/rpmbuild/BUILD/elfutils-0.179/src/strip.o
FAIL run-readelf-self.sh (exit status: 1)

FAIL: run-varlocs-self.sh
=========================

/home/tkloczko/rpmbuild/BUILD/elfutils-0.179/tests/varlocs: No DWARF CU found?
*** failure in /home/tkloczko/rpmbuild/BUILD/elfutils-0.179/tests/varlocs -e
/home/tkloczko/rpmbuild/BUILD/elfutils-0.179/src/size.o
/home/tkloczko/rpmbuild/BUILD/elfutils-0.179/tests/varlocs: No DWARF CU found?
*** failure in /home/tkloczko/rpmbuild/BUILD/elfutils-0.179/tests/varlocs -e
/home/tkloczko/rpmbuild/BUILD/elfutils-0.179/src/strip.o
FAIL run-varlocs-self.sh (exit status: 1)

FAIL: run-exprlocs-self.sh
==========================

/home/tkloczko/rpmbuild/BUILD/elfutils-0.179/tests/varlocs: No DWARF CU found?
*** failure in /home/tkloczko/rpmbuild/BUILD/elfutils-0.179/tests/varlocs
--exprlocs -e /home/tkloczko/rpmbuild/BUILD/elfutils-0.179/src/size.o
/home/tkloczko/rpmbuild/BUILD/elfutils-0.179/tests/varlocs: No DWARF CU found?
*** failure in /home/tkloczko/rpmbuild/BUILD/elfutils-0.179/tests/varlocs
--exprlocs -e /home/tkloczko/rpmbuild/BUILD/elfutils-0.179/src/strip.o
FAIL run-exprlocs-self.sh (exit status: 1)

SKIP: run-lfs-symbols.sh
========================

LFS testing is irrelevent on this system
SKIP run-lfs-symbols.sh (exit status: 77)

FAIL: run-dwarf-die-addr-die.sh
===============================

checking testfile-debug-types
checking CU at 0
checking TU at 0
checking Type DIE at 4f
checking TU at 43
checking Type DIE at 7f
checking 2 subdie
checking 2 subdie
checking testfile_multi_main
checking CU at 0
checking alt debug
checking CU at 0
checking testfilebazdbgppc64.debug
checking CU at 0
checking CU at 90
checking testfile-dwarf-4
checking CU at 0
checking CU at 211
checking testfile-dwarf-5
checking CU at 0
checking CU at 20c
checking testfile-splitdwarf-4
checking CU at 0
checking CU at 34
checking 4 subdie
checking 4 subdie
checking testfile-splitdwarf-5
checking CU at 0
checking CU at 35
checking 4 subdie
checking 4 subdie
checking testfile-hello4.dwo
checking CU at 0
checking testfile-world4.dwo
checking CU at 0
checking testfile-hello5.dwo
checking CU at 0
checking testfile-world5.dwo
checking CU at 0
checking /home/tkloczko/rpmbuild/BUILD/elfutils-0.179/src/addr2line
checking CU at 0
checking CU at 2851
checking CU at 438d
checking /home/tkloczko/rpmbuild/BUILD/elfutils-0.179/src/elfclassify
checking CU at 0
checking CU at 2096
checking CU at 3415
checking /home/tkloczko/rpmbuild/BUILD/elfutils-0.179/src/stack
checking CU at 0
checking CU at 282a
checking CU at 421b
checking /home/tkloczko/rpmbuild/BUILD/elfutils-0.179/src/unstrip
checking CU at 0
checking CU at 838f
checking CU at b5a4
checking CU at b6cf
checking /home/tkloczko/rpmbuild/BUILD/elfutils-0.179/libelf/libelf.so
checking CU at 0
checking CU at 1709e
checking CU at 17335
checking CU at 17415
checking CU at 17768
checking CU at 178b4
checking CU at 19604
checking CU at 1a5b9
checking CU at 1b53b
checking CU at 1c598
checking CU at 1d50e
checking CU at 1e484
checking CU at 1f3fa
checking CU at 20386
checking CU at 20665
checking CU at 20944
checking CU at 21a5a
checking CU at 21e78
checking CU at 22296
checking CU at 226b4
checking CU at 22ad2
checking CU at 24d65
checking CU at 25e7c
checking CU at 26f93
checking CU at 28103
checking CU at 2922a
checking CU at 2a351
checking CU at 2b2d3
checking CU at 2c449
checking CU at 2d776
checking CU at 2eac0
checking CU at 2fc39
checking CU at 30dec
checking CU at 31f9f
checking CU at 32f21
checking CU at 340bb
checking CU at 351be
checking CU at 36646
checking CU at 3772d
checking CU at 38af4
checking CU at 39bc9
checking CU at 3ad03
checking CU at 3bcc4
checking CU at 3cc3a
checking CU at 3dd9e
checking CU at 3f133
checking CU at 404e5
checking CU at 4163a
checking CU at 427bc
checking CU at 43981
checking CU at 44a76
checking CU at 45ffb
checking CU at 47119
checking CU at 48451
checking CU at 49553
checking CU at 4a655
checking CU at 4b757
checking CU at 4c859
checking CU at 4d95b
checking CU at 4ea79
checking CU at 4fb42
checking CU at 50e38
checking CU at 52329
checking CU at 53828
checking CU at 5555a
checking CU at 5728c
checking CU at 584ca
checking CU at 59712
checking CU at 5a85c
checking CU at 5ba1c
checking CU at 5cbdc
checking CU at 5ddb8
checking CU at 5ef4e
checking CU at 60127
checking CU at 6134c
checking CU at 6250c
checking CU at 63718
checking CU at 64954
checking CU at 65b8e
checking CU at 66d20
checking CU at 67ec5
checking CU at 69021
checking CU at 6a1bc
checking CU at 6b3f0
checking CU at 6c5e0
checking CU at 6d785
checking CU at 6e734
checking CU at 6f6e3
checking CU at 70bb7
checking CU at 71e2b
checking CU at 730a9
checking CU at 741fc
checking CU at 753e3
checking CU at 765ca
checking CU at 777cd
checking CU at 7898a
checking CU at 79b37
checking CU at 7ac53
checking CU at 7be9d
checking CU at 7ce13
checking CU at 7df63
checking CU at 7f0b3
checking CU at 7f1af
checking CU at 7f249
checking CU at 803f1
checking CU at 81581
checking CU at 8271b
checking CU at 83810
checking CU at 84905
checking CU at 859da
checking CU at 86983
checking CU at 86a34
checking CU at 879c4
checking CU at 88ae9
checking CU at 89c1c
checking CU at 8adb9
checking CU at 8c59d
checking /home/tkloczko/rpmbuild/BUILD/elfutils-0.179/libasm/libasm.so
checking CU at 0
checking CU at 4d25
checking CU at 5889
checking CU at 604a
checking CU at 701c
checking CU at 7173
checking CU at 7934
checking CU at 843d
checking CU at 8d55
checking CU at 9539
checking CU at 9e8d
checking CU at a755
checking CU at b01d
checking CU at b8f2
checking CU at c0d5
checking CU at c924
checking CU at d24b
checking CU at db20
checking CU at e41d
checking CU at ec02
checking CU at f530
checking CU at fd2d
checking CU at 1064f
checking CU at 10e34
checking CU at 1176e
checking CU at 11f53
checking CU at 12842
checking CU at 13155
checking CU at 1422f
checking CU at 155d9
checking CU at 1578c
checking CU at 15a94
checking CU at 16449
checking CU at 1745c
checking CU at 1846f
Not a Dwarf file '/home/tkloczko/rpmbuild/BUILD/elfutils-0.179/src/size.o': no
DWARF information
*** failure in
/home/tkloczko/rpmbuild/BUILD/elfutils-0.179/tests/dwarf-die-addr-die
/home/tkloczko/rpmbuild/BUILD/elfutils-0.179/src/size.o
Not a Dwarf file '/home/tkloczko/rpmbuild/BUILD/elfutils-0.179/src/strip.o': no
DWARF information
*** failure in
/home/tkloczko/rpmbuild/BUILD/elfutils-0.179/tests/dwarf-die-addr-die
/home/tkloczko/rpmbuild/BUILD/elfutils-0.179/src/strip.o
FAIL run-dwarf-die-addr-die.sh (exit status: 1)

FAIL: run-get-units-invalid.sh
==============================

file: testfile-debug-types
Got cudie: (null), unit_type: 1
Got cudie: (null), unit_type: 2
subdie: B
Got cudie: (null), unit_type: 2
subdie: A

file: testfile_multi_main
Got cudie: main.c, unit_type: 1

file: testfilebazdbgppc64.debug
Got cudie: foo.c, unit_type: 1
Got cudie: bar.c, unit_type: 1

file: testfile-dwarf-4
Got cudie: hello.c, unit_type: 1
Got cudie: world.c, unit_type: 1

file: testfile-dwarf-5
Got cudie: hello.c, unit_type: 1
Got cudie: world.c, unit_type: 1

file: /home/tkloczko/rpmbuild/BUILD/elfutils-0.179/src/addr2line
Got cudie: <artificial>, unit_type: 1
Got cudie: addr2line.c, unit_type: 1
Got cudie: printversion.c, unit_type: 1

file: /home/tkloczko/rpmbuild/BUILD/elfutils-0.179/src/elfclassify
Got cudie: <artificial>, unit_type: 1
Got cudie: elfclassify.c, unit_type: 1
Got cudie: printversion.c, unit_type: 1

file: /home/tkloczko/rpmbuild/BUILD/elfutils-0.179/src/stack
Got cudie: <artificial>, unit_type: 1
Got cudie: stack.c, unit_type: 1
Got cudie: printversion.c, unit_type: 1

file: /home/tkloczko/rpmbuild/BUILD/elfutils-0.179/src/unstrip
Got cudie: <artificial>, unit_type: 1
Got cudie: unstrip.c, unit_type: 1
Got cudie: xmalloc.c, unit_type: 1
Got cudie: printversion.c, unit_type: 1

file: /home/tkloczko/rpmbuild/BUILD/elfutils-0.179/libelf/libelf.so
Got cudie: <artificial>, unit_type: 1
Got cudie: elf_version.c, unit_type: 1
Got cudie: elf_hash.c, unit_type: 1
Got cudie: elf_error.c, unit_type: 1
Got cudie: elf_fill.c, unit_type: 1
Got cudie: elf_begin.c, unit_type: 1
Got cudie: elf_next.c, unit_type: 1
Got cudie: elf_rand.c, unit_type: 1
Got cudie: elf_end.c, unit_type: 1
Got cudie: elf_kind.c, unit_type: 1
Got cudie: gelf_getclass.c, unit_type: 1
Got cudie: elf_getbase.c, unit_type: 1
Got cudie: elf_getident.c, unit_type: 1
Got cudie: elf32_fsize.c, unit_type: 1
Got cudie: elf64_fsize.c, unit_type: 1
Got cudie: gelf_fsize.c, unit_type: 1
Got cudie: elf32_xlatetof.c, unit_type: 1
Got cudie: elf32_xlatetom.c, unit_type: 1
Got cudie: elf64_xlatetof.c, unit_type: 1
Got cudie: elf64_xlatetom.c, unit_type: 1
Got cudie: gelf_xlate.c, unit_type: 1
Got cudie: elf32_getehdr.c, unit_type: 1
Got cudie: elf64_getehdr.c, unit_type: 1
Got cudie: gelf_getehdr.c, unit_type: 1
Got cudie: elf32_newehdr.c, unit_type: 1
Got cudie: elf64_newehdr.c, unit_type: 1
Got cudie: gelf_newehdr.c, unit_type: 1
Got cudie: gelf_update_ehdr.c, unit_type: 1
Got cudie: elf32_getphdr.c, unit_type: 1
Got cudie: elf64_getphdr.c, unit_type: 1
Got cudie: gelf_getphdr.c, unit_type: 1
Got cudie: elf32_newphdr.c, unit_type: 1
Got cudie: elf64_newphdr.c, unit_type: 1
Got cudie: gelf_newphdr.c, unit_type: 1
Got cudie: gelf_update_phdr.c, unit_type: 1
Got cudie: elf_getarhdr.c, unit_type: 1
Got cudie: elf_getarsym.c, unit_type: 1
Got cudie: elf_rawfile.c, unit_type: 1
Got cudie: elf_readall.c, unit_type: 1
Got cudie: elf_cntl.c, unit_type: 1
Got cudie: elf_getscn.c, unit_type: 1
Got cudie: elf_nextscn.c, unit_type: 1
Got cudie: elf_ndxscn.c, unit_type: 1
Got cudie: elf_newscn.c, unit_type: 1
Got cudie: elf32_getshdr.c, unit_type: 1
Got cudie: elf64_getshdr.c, unit_type: 1
Got cudie: gelf_getshdr.c, unit_type: 1
Got cudie: gelf_update_shdr.c, unit_type: 1
Got cudie: elf_strptr.c, unit_type: 1
Got cudie: elf_rawdata.c, unit_type: 1
Got cudie: elf_getdata.c, unit_type: 1
Got cudie: elf_newdata.c, unit_type: 1
Got cudie: elf_getdata_rawchunk.c, unit_type: 1
Got cudie: elf_flagelf.c, unit_type: 1
Got cudie: elf_flagehdr.c, unit_type: 1
Got cudie: elf_flagphdr.c, unit_type: 1
Got cudie: elf_flagscn.c, unit_type: 1
Got cudie: elf_flagshdr.c, unit_type: 1
Got cudie: elf_flagdata.c, unit_type: 1
Got cudie: elf_memory.c, unit_type: 1
Got cudie: elf_update.c, unit_type: 1
Got cudie: elf32_updatenull.c, unit_type: 1
Got cudie: elf64_updatenull.c, unit_type: 1
Got cudie: elf32_updatefile.c, unit_type: 1
Got cudie: elf64_updatefile.c, unit_type: 1
Got cudie: gelf_getsym.c, unit_type: 1
Got cudie: gelf_update_sym.c, unit_type: 1
Got cudie: gelf_getversym.c, unit_type: 1
Got cudie: gelf_getverneed.c, unit_type: 1
Got cudie: gelf_getvernaux.c, unit_type: 1
Got cudie: gelf_getverdef.c, unit_type: 1
Got cudie: gelf_getverdaux.c, unit_type: 1
Got cudie: gelf_getrel.c, unit_type: 1
Got cudie: gelf_getrela.c, unit_type: 1
Got cudie: gelf_update_rel.c, unit_type: 1
Got cudie: gelf_update_rela.c, unit_type: 1
Got cudie: gelf_getdyn.c, unit_type: 1
Got cudie: gelf_update_dyn.c, unit_type: 1
Got cudie: gelf_getmove.c, unit_type: 1
Got cudie: gelf_update_move.c, unit_type: 1
Got cudie: gelf_getsyminfo.c, unit_type: 1
Got cudie: gelf_update_syminfo.c, unit_type: 1
Got cudie: gelf_getauxv.c, unit_type: 1
Got cudie: gelf_update_auxv.c, unit_type: 1
Got cudie: gelf_getnote.c, unit_type: 1
Got cudie: gelf_xlatetof.c, unit_type: 1
Got cudie: gelf_xlatetom.c, unit_type: 1
Got cudie: nlist.c, unit_type: 1
Got cudie: gelf_getsymshndx.c, unit_type: 1
Got cudie: gelf_update_symshndx.c, unit_type: 1
Got cudie: gelf_update_versym.c, unit_type: 1
Got cudie: gelf_update_verneed.c, unit_type: 1
Got cudie: gelf_update_vernaux.c, unit_type: 1
Got cudie: gelf_update_verdef.c, unit_type: 1
Got cudie: gelf_update_verdaux.c, unit_type: 1
Got cudie: elf_getphdrnum.c, unit_type: 1
Got cudie: elf_getshdrnum.c, unit_type: 1
Got cudie: elf_getshdrstrndx.c, unit_type: 1
Got cudie: gelf_checksum.c, unit_type: 1
Got cudie: elf32_checksum.c, unit_type: 1
Got cudie: elf64_checksum.c, unit_type: 1
Got cudie: libelf_crc32.c, unit_type: 1
Got cudie: libelf_next_prime.c, unit_type: 1
Got cudie: elf_clone.c, unit_type: 1
Got cudie: gelf_getlib.c, unit_type: 1
Got cudie: gelf_update_lib.c, unit_type: 1
Got cudie: elf32_offscn.c, unit_type: 1
Got cudie: elf64_offscn.c, unit_type: 1
Got cudie: gelf_offscn.c, unit_type: 1
Got cudie: elf_getaroff.c, unit_type: 1
Got cudie: elf_gnu_hash.c, unit_type: 1
Got cudie: elf_scnshndx.c, unit_type: 1
Got cudie: elf32_getchdr.c, unit_type: 1
Got cudie: elf64_getchdr.c, unit_type: 1
Got cudie: gelf_getchdr.c, unit_type: 1
Got cudie: elf_compress.c, unit_type: 1
Got cudie: elf_compress_gnu.c, unit_type: 1

file: /home/tkloczko/rpmbuild/BUILD/elfutils-0.179/libasm/libasm.so
Got cudie: <artificial>, unit_type: 1
Got cudie: asm_begin.c, unit_type: 1
Got cudie: asm_abort.c, unit_type: 1
Got cudie: asm_end.c, unit_type: 1
Got cudie: asm_error.c, unit_type: 1
Got cudie: asm_getelf.c, unit_type: 1
Got cudie: asm_newscn.c, unit_type: 1
Got cudie: asm_newscn_ingrp.c, unit_type: 1
Got cudie: asm_newsubscn.c, unit_type: 1
Got cudie: asm_newsym.c, unit_type: 1
Got cudie: asm_newcomsym.c, unit_type: 1
Got cudie: asm_newabssym.c, unit_type: 1
Got cudie: asm_newscngrp.c, unit_type: 1
Got cudie: asm_scngrp_newsignature.c, unit_type: 1
Got cudie: asm_fill.c, unit_type: 1
Got cudie: asm_align.c, unit_type: 1
Got cudie: asm_addstrz.c, unit_type: 1
Got cudie: asm_addint8.c, unit_type: 1
Got cudie: asm_adduint8.c, unit_type: 1
Got cudie: asm_addint16.c, unit_type: 1
Got cudie: asm_adduint16.c, unit_type: 1
Got cudie: asm_addint32.c, unit_type: 1
Got cudie: asm_adduint32.c, unit_type: 1
Got cudie: asm_addint64.c, unit_type: 1
Got cudie: asm_adduint64.c, unit_type: 1
Got cudie: asm_adduleb128.c, unit_type: 1
Got cudie: asm_addsleb128.c, unit_type: 1
Got cudie: disasm_begin.c, unit_type: 1
Got cudie: disasm_cb.c, unit_type: 1
Got cudie: disasm_end.c, unit_type: 1
Got cudie: disasm_str.c, unit_type: 1
Got cudie: symbolhash.c, unit_type: 1
Got cudie: eblelfclass.c, unit_type: 1
Got cudie: eblelfdata.c, unit_type: 1
Got cudie: eblelfmachine.c, unit_type: 1

file: /home/tkloczko/rpmbuild/BUILD/elfutils-0.179/src/size.o
/home/tkloczko/rpmbuild/BUILD/elfutils-0.179/src/size.o not usable: no DWARF
information
*** failure in
/home/tkloczko/rpmbuild/BUILD/elfutils-0.179/tests/get-units-invalid
/home/tkloczko/rpmbuild/BUILD/elfutils-0.179/src/size.o
file: /home/tkloczko/rpmbuild/BUILD/elfutils-0.179/src/strip.o
/home/tkloczko/rpmbuild/BUILD/elfutils-0.179/src/strip.o not usable: no DWARF
information
*** failure in
/home/tkloczko/rpmbuild/BUILD/elfutils-0.179/tests/get-units-invalid
/home/tkloczko/rpmbuild/BUILD/elfutils-0.179/src/strip.o
FAIL run-get-units-invalid.sh (exit status: 1)

FAIL: run-reverse-sections-self.sh
==================================


copy_elf: /home/tkloczko/rpmbuild/BUILD/elfutils-0.179/src/addr2line ->
addr2line.rev (read,reverse)
setshstrndx: 38
Swapping offsets of section 29 and 30
Swapping offsets of section 31 and 32
Swapping offsets of section 33 and 34
Swapping offsets of section 37 and 38
No errors
elfrdwrdnop addr2line.rev
No errors

copy_elf: /home/tkloczko/rpmbuild/BUILD/elfutils-0.179/src/elfclassify ->
elfclassify.rev (read,reverse)
setshstrndx: 38
Swapping offsets of section 29 and 30
Swapping offsets of section 31 and 32
Swapping offsets of section 33 and 34
Swapping offsets of section 37 and 38
No errors
elfrdwrdnop elfclassify.rev
No errors

copy_elf: /home/tkloczko/rpmbuild/BUILD/elfutils-0.179/src/stack -> stack.rev
(read,reverse)
setshstrndx: 38
Swapping offsets of section 29 and 30
Swapping offsets of section 31 and 32
Swapping offsets of section 33 and 34
Swapping offsets of section 37 and 38
No errors
elfrdwrdnop stack.rev
No errors

copy_elf: /home/tkloczko/rpmbuild/BUILD/elfutils-0.179/src/unstrip ->
unstrip.rev (read,reverse)
setshstrndx: 38
Swapping offsets of section 29 and 30
Swapping offsets of section 31 and 32
Swapping offsets of section 33 and 34
Swapping offsets of section 37 and 38
No errors
elfrdwrdnop unstrip.rev
No errors

copy_elf: /home/tkloczko/rpmbuild/BUILD/elfutils-0.179/libelf/libelf.so ->
libelf.so.rev (read,reverse)
setshstrndx: 37
Swapping offsets of section 28 and 29
Swapping offsets of section 30 and 31
Swapping offsets of section 32 and 33
Swapping offsets of section 36 and 37
No errors
elfrdwrdnop libelf.so.rev
No errors

copy_elf: /home/tkloczko/rpmbuild/BUILD/elfutils-0.179/libasm/libasm.so ->
libasm.so.rev (read,reverse)
setshstrndx: 37
Swapping offsets of section 28 and 29
Swapping offsets of section 30 and 31
Swapping offsets of section 32 and 33
Swapping offsets of section 36 and 37
No errors
elfrdwrdnop libasm.so.rev
No errors

copy_elf: /home/tkloczko/rpmbuild/BUILD/elfutils-0.179/src/size.o -> size.o.rev
(read,reverse)
setshstrndx: 74
Swapping offsets of section 5 and 6
Swapping offsets of section 24 and 25
Swapping offsets of section 26 and 27
Swapping offsets of section 28 and 29
Swapping offsets of section 30 and 31
Swapping offsets of section 32 and 33
Swapping offsets of section 34 and 35
Swapping offsets of section 36 and 37
Swapping offsets of section 38 and 39
Swapping offsets of section 40 and 41
Swapping offsets of section 42 and 43
Swapping offsets of section 44 and 45
Swapping offsets of section 46 and 47
Swapping offsets of section 48 and 49
Swapping offsets of section 50 and 51
Swapping offsets of section 52 and 53
Swapping offsets of section 54 and 55
Swapping offsets of section 56 and 57
Swapping offsets of section 58 and 59
Swapping offsets of section 60 and 61
Swapping offsets of section 62 and 63
Swapping offsets of section 64 and 65
Swapping offsets of section 66 and 67
Swapping offsets of section 68 and 69
section [22] '.gnu.debuglto_.debug_info' contains invalid processor-specific
flag(s) 0x80000000
section [24] '.gnu.debuglto_.debug_abbrev' contains invalid processor-specific
flag(s) 0x80000000
section [25] '.gnu.debuglto_.debug_line' contains invalid processor-specific
flag(s) 0x80000000
section [26] '.gnu.debuglto_.debug_str' contains invalid processor-specific
flag(s) 0x80000000
section [27] '.gnu.lto_.profile.983b015b3c475f2b' contains invalid
processor-specific flag(s) 0x80000000
section [28] '.gnu.lto_.icf.983b015b3c475f2b' contains invalid
processor-specific flag(s) 0x80000000
section [29] '.gnu.lto_.jmpfuncs.983b015b3c475f2b' contains invalid
processor-specific flag(s) 0x80000000
section [30] '.gnu.lto_.ipa_sra.983b015b3c475f2b' contains invalid
processor-specific flag(s) 0x80000000
section [31] '.gnu.lto_.inline.983b015b3c475f2b' contains invalid
processor-specific flag(s) 0x80000000
section [32] '.gnu.lto_.pureconst.983b015b3c475f2b' contains invalid
processor-specific flag(s) 0x80000000
section [33] '.gnu.lto_.lto.983b015b3c475f2b' contains invalid
processor-specific flag(s) 0x80000000
section [34] '.gnu.lto_argp_program_version_hook.90.983b015b3c475f2b' contains
invalid processor-specific flag(s) 0x80000000
section [35] '.gnu.lto_argp_program_bug_address.91.983b015b3c475f2b' contains
invalid processor-specific flag(s) 0x80000000
section [36] '.gnu.lto_options.92.983b015b3c475f2b' contains invalid
processor-specific flag(s) 0x80000000
section [37] '.gnu.lto_doc.93.983b015b3c475f2b' contains invalid
processor-specific flag(s) 0x80000000
section [38] '.gnu.lto_argp.95.983b015b3c475f2b' contains invalid
processor-specific flag(s) 0x80000000
section [39] '.gnu.lto_length_map.98.983b015b3c475f2b' contains invalid
processor-specific flag(s) 0x80000000
section [40] '.gnu.lto_main.101.983b015b3c475f2b' contains invalid
processor-specific flag(s) 0x80000000
section [41] '.gnu.lto_parse_opt.102.983b015b3c475f2b' contains invalid
processor-specific flag(s) 0x80000000
section [42] '.gnu.lto_process_file.103.983b015b3c475f2b' contains invalid
processor-specific flag(s) 0x80000000
section [43] '.gnu.lto_print_header.104.983b015b3c475f2b' contains invalid
processor-specific flag(s) 0x80000000
section [44] '.gnu.lto_handle_ar.105.983b015b3c475f2b' contains invalid
processor-specific flag(s) 0x80000000
section [45] '.gnu.lto_show_sysv.106.983b015b3c475f2b' contains invalid
processor-specific flag(s) 0x80000000
section [46] '.gnu.lto_show_sysv_one_line.107.983b015b3c475f2b' contains
invalid processor-specific flag(s) 0x80000000
section [47] '.gnu.lto_show_bsd.111.983b015b3c475f2b' contains invalid
processor-specific flag(s) 0x80000000
section [48] '.gnu.lto_show_bsd_totals.112.983b015b3c475f2b' contains invalid
processor-specific flag(s) 0x80000000
section [49] '.gnu.lto_show_segments.113.983b015b3c475f2b' contains invalid
processor-specific flag(s) 0x80000000
section [50] '.gnu.lto_handle_elf.114.983b015b3c475f2b' contains invalid
processor-specific flag(s) 0x80000000
section [51] '.gnu.lto_.symbol_nodes.983b015b3c475f2b' contains invalid
processor-specific flag(s) 0x80000000
section [52] '.gnu.lto_.refs.983b015b3c475f2b' contains invalid
processor-specific flag(s) 0x80000000
section [53] '.gnu.lto_.decls.983b015b3c475f2b' contains invalid
processor-specific flag(s) 0x80000000
section [54] '.gnu.lto_.symtab.983b015b3c475f2b' contains invalid
processor-specific flag(s) 0x80000000
section [55] '.gnu.lto_.ext_symtab.983b015b3c475f2b' contains invalid
processor-specific flag(s) 0x80000000
section [56] '.gnu.lto_.opts' contains invalid processor-specific flag(s)
0x80000000
FAIL run-reverse-sections-self.sh (exit status: 1)

============================================================================
Testsuite summary for elfutils 0.179
============================================================================
# TOTAL: 218
# PASS:  207
# SKIP:  1
# XFAIL: 0
# FAIL:  10
# XPASS: 0
# ERROR: 0
============================================================================
See tests/test-suite.log
Please report to https://sourceware.org/bugzilla
============================================================================
make[3]: *** [Makefile:2432: test-suite.log] Error 1
make[2]: *** [Makefile:2540: check-TESTS] Error 2
make[1]: *** [Makefile:4133: check-am] Error 2
make: *** [Makefile:499: check-recursive] Error 1

-- 
You are receiving this mail because:
You are on the CC list for the bug.


More information about the Elfutils-devel mailing list