Compilation problem
Mon Apr 6 09:27:05 GMT 2020

>Hello,  I am a user of ALOGRAF 5, and once I have created my Application, I
>cannot compile it. I have this message:

>*4 [main] make 16532 find_fast_cwd: WARNING: Couldn't compute FAST_CWD
>pointer.  Please report this problem tothe public mailing list
> <>make[1]: Entering directory
>`/cygdrive/d/PROJET/Appli/NanOpral-1'----------- 001.ogenerated/001.c: In
>function 'Grafcet_1_32769':generated/001.c:26:3: error: 'Voyant' undeclared
>(first use in this function)generated/001.c:26:3: note: each undeclared
>identifier is reported only once for each function it appears
>ingenerated/001.c: In function 'Grafcet_1_1':generated/001.c:36:6: error:
>'Bp' undeclared (first use in this function)generated/001.c:36:10: error:
>expected ')' before ';' tokengenerated/001.c:38:3: error: 'Voyant'
>undeclared (first use in this function)make[1]: ***
>[generated/generated/001.o] Error 1make[1]: Leaving directory
>`/cygdrive/d/PROJET/Appli/NanOpral-1'mingw32-make: *** [all] Error 2*

>Please help me (I have Windows 10 x64)  .

>Cordialement ,
>*SOW Souleymane*
>Etudiant en Master Energie Electrique, Electronique, Automatique
>Université Jean Monnet de Saint-Etienne
>Tel: +33 7 60-07-58-73
>Email: * <>*
>Adresse: 1, Place Paul Gauguin 42300 Roanne

>sans virus.

More information about the Cygwin mailing list