failed checks during make check after building cygwin

Gerrit P. Haase gerrit@familiehaase.de
Fri Jan 5 09:48:00 GMT 2001


-----BEGIN PGP SIGNED MESSAGE-----
Hash: SHA1

$ make check
make[1]: Entering directory `/src/test/new/bfd'
Making check in doc
make[2]: Entering directory `/src/test/new/bfd/doc'
make[2]: Nothing to be done for `check'.
make[2]: Leaving directory `/src/test/new/bfd/doc'
Making check in po
make[2]: Entering directory `/src/test/new/bfd/po'
make[2]: Nothing to be done for `check'.
make[2]: Leaving directory `/src/test/new/bfd/po'
make[2]: Entering directory `/src/test/new/bfd'
make[2]: Nothing to be done for `check-am'.
make[2]: Leaving directory `/src/test/new/bfd'
make[1]: Leaving directory `/src/test/new/bfd'
make[1]: Entering directory `/src/test/new/etc'
make[1]: Nothing to be done for `check'.
make[1]: Leaving directory `/src/test/new/etc'
make[1]: Entering directory `/src/test/new/intl'
make[1]: Nothing to be done for `check'.
make[1]: Leaving directory `/src/test/new/intl'
make[1]: Entering directory `/src/test/new/libiberty'
make[2]: Entering directory `/src/test/new/libiberty/testsuite'
echo 'int prepends_underscore = 0;' > test-us.c
gcc -DHAVE_CONFIG_H  -I.. -I../../../src-build/libiberty/testsuite/../../include  -o test-filter -DMAIN -DVERSION='"none"' -DHAVE_CONFIG_H \
        ../../../src-build/libiberty/testsuite/../cplus-dem.c test-us.c -L.. -liberty
sh ../../../src-build/libiberty/testsuite/regress-demangle ../../../src-build/libiberty/testsuite/demangle-expected
FAIL: --format=gnu _10PageButton\$__both
   result: _10PageButton\$__both
 expected: PageButton::__both
FAIL: --format=gnu _3RNG\$singleMantissa
   result: _3RNG\$singleMantissa
 expected: RNG::singleMantissa
FAIL: --format=gnu _5IComp\$_release
   result: _5IComp\$_release
 expected: IComp::_release
FAIL: --format=gnu _\$_10BitmapComp
   result: _\$_10BitmapComp
 expected: BitmapComp::~BitmapComp(void)
FAIL: --format=gnu _\$_9__io_defs
   result: _\$_9__io_defs
 expected: __io_defs::~__io_defs(void)
FAIL: --format=gnu _\$_Q23foo3bar
   result: _\$_Q23foo3bar
 expected: foo::bar::~bar(void)
FAIL: --format=gnu _\$_Q33foo3bar4bell
   result: _\$_Q33foo3bar4bell
 expected: foo::bar::bell::~bell(void)
FAIL: --format=gnu _vt\$foo
   result:  virtual table\$foo
 expected: foo virtual table
FAIL: --format=gnu _vt\$foo\$bar
   result:  virtual table\$foo\$bar
 expected: foo::bar virtual table
FAIL: --format=gnu _2T4\$N
   result: _2T4\$N
 expected: T4::N
FAIL: --format=gnu _Q22T42t1\$N
   result: _Q22T42t1\$N
 expected: T4::t1::N
FAIL: --format=gnu _\$_t6vector1Zdi
   result: _\$_t6vector1Zdi
 expected: vector<double>::~vector(int)
FAIL: --format=gnu _\$_t6vector1Zii
   result: _\$_t6vector1Zii
 expected: vector<int>::~vector(int)
FAIL: --format=gnu _GLOBAL_\$D\$set
   result: _GLOBAL_\$D\$set
 expected: global destructors keyed to set
FAIL: --format=gnu _GLOBAL_\$I\$set
   result: _GLOBAL_\$I\$set
 expected: global constructors keyed to set
FAIL: --format=gnu _vt\$t8BDDHookV1ZPc
   result:  virtual table\$t8BDDHookV1ZPc
 expected: BDDHookV<char *> virtual table
FAIL: --format=gnu _26_GLOBAL_\$N\$_tmp_n.iilg4Gya\$app_instance
   result: _26_GLOBAL_\$N\$_tmp_n.iilg4Gya\$app_instance
 expected: {anonymous}::app_instance
17 of 640 tests failed
make[2]: *** [check-cplus-dem] Error 1
make[2]: Leaving directory `/src/test/new/libiberty/testsuite'
make[1]: *** [check-subdir] Error 2
make[1]: Leaving directory `/src/test/new/libiberty'
make: *** [check-libiberty] Error 2


-----BEGIN PGP SIGNATURE-----
Version: PGP 6.5.8 -- QDPGP 2.61c

iQA/AwUBOlX0caMmDzzIydaaEQJcTwCfbIfb7Kzl2yKhHZlrPeauDcBBa2sAn3ti
9hjWkclbg/5KwkwRkdYj1u0G
=xi/2
-----END PGP SIGNATURE-----
gph
--
gerrit.haase@convey.de
PGP Version: 6.5.8 Public Key Information
KeyID: 0xC8C9D69A, Type/Size: DH/DSS 2048/1024bit 
Key fingerprint = 57C8 1B1D CFE4 8515 AA3E  4499 A326 0F3C C8C9 D69A

--
Want to unsubscribe from this list?
Check out: http://cygwin.com/ml/#unsubscribe-simple



More information about the Cygwin mailing list