configure: error: Link tests are not allowed after GCC_NO_EXECUTABLES.

Darcy Watkins dwatkins@tranzeo.com
Fri Oct 14 13:41:00 GMT 2011


On Thu, 2011-10-13 at 16:38 -0700, Khem Raj wrote:
> On Thu, Oct 13, 2011 at 11:14 AM, Darcy Watkins <dwatkins@tranzeo.com>
> wrote:
> > [ERROR]    checking dynamic linker characteristics... configure:
> error:
> > Link tests are not allowed after GCC_NO_EXECUTABLES.
> > [ERROR]    make[2]: *** [configure-target-libstdc++-v3] Error 1
> > [ALL  ]    make[2]: Leaving directory
> >
> `/media/stuff/workspace/tsf/powerpc-nptl-dev/pkgs_build/crosstool-ng-1.12_powerpc/crosstool-ng-1.12.4/targets/powerpc-nptl-linux-gnu/build/build-cc'
> > [ERROR]    make[1]: *** [all] Error 2
> > [ALL  ]    make[1]: Leaving directory
> 
> Can you post the config.log file from libsdc++ configure directory ?


Hi Khem,

It is attached (bzip compressed).  Actually this one was for glibc 2.14.
I figured I'd try 2.14 but got the exact same results as for glibc 2.13.
But I think this is part of gcc 4.5.3, not glibc.

Regards,

Darcy


> 
> 

-------------- next part --------------
A non-text attachment was scrubbed...
Name: libstdc++-v3_config.log.bz2
Type: application/x-bzip
Size: 6515 bytes
Desc: not available
URL: <http://sourceware.org/pipermail/crossgcc/attachments/20111014/0833714a/attachment.bin>
-------------- next part --------------
--
For unsubscribe information see http://sourceware.org/lists.html#faq


More information about the crossgcc mailing list