CT-NG build error PPL

Matthias Hofmann matthias.hofmann@tu-dortmund.de
Tue May 11 16:14:00 GMT 2010


Hi,

additionally, the sample configuration "i586-geode-linux-uclibx" breaks
with the same error messages under my cygwin.

thank you,

matthias

> Hi,
>
> CT-NG 1.7 breaks with the following configuration on the stage "Installing
> static core C Library" with the following error on Cygwin:
> seems to me that PPL lib is not found correctly during the link process.
> config is attached.
> ....
> [ERROR]
> /usr/ct-ng-1.7/targets/i586-unknown-linux-gnu/build/static/lib/libppl
> .a(Polyhedron_public.o):Polyhedron_public.cc:(.text+0x5206): undefined
> reference
>  to `std::runtime_error::~runtime_error()'
> [ERROR]
> /usr/ct-ng-1.7/targets/i586-unknown-linux-gnu/build/static/lib/libppl
> .a(Polyhedron_public.o):Polyhedron_public.cc:(.text+0x54c5): undefined
> reference
>  to `std::runtime_error::runtime_error(std::basic_string<char,
> std::char_traits<
> char>, std::allocator<char> > const&)'
> [ERROR]
> /usr/ct-ng-1.7/targets/i586-unknown-linux-gnu/build/static/lib/libppl
> .a(Polyhedron_public.o):Polyhedron_public.cc:(.text+0xacf4): undefined
> reference
>  to `std::length_error::length_error(std::basic_string<char,
> std::char_traits<ch
> ar>, std::allocator<char> > const&)'
> [ERROR]
> /usr/ct-ng-1.7/targets/i586-unknown-linux-gnu/build/static/lib/libppl
> .a(Polyhedron_public.o):Polyhedron_public.cc:(.text+0xad74): undefined
> reference
>  to `std::length_error::length_error(std::basic_string<char,
> std::char_traits<ch
> ar>, std::allocator<char> > const&)'
> [ERROR]
> /usr/ct-ng-1.7/targets/i586-unknown-linux-gnu/build/static/lib/libppl
> .a(Polyhedron_public.o):Polyhedron_public.cc:(.text+0xb055): undefined
> reference
>  to `std::length_error::length_error(std::basic_string<char,
> std::char_traits<ch
> ar>, std::allocator<char> > const&)'
> [ERROR]
> /usr/ct-ng-1.7/targets/i586-unknown-linux-gnu/build/static/lib/libppl
> .a(Polyhedron_public.o):Polyhedron_public.cc:(.text+0xb8b7): undefined
> reference
>  to `std::length_error::length_error(std::basic_string<char,
> std::char_traits<ch
> ar>, std::allocator<char> > const&)'
> [ERROR]
> /usr/ct-ng-1.7/targets/i586-unknown-linux-gnu/build/static/lib/libppl
> .a(Polyhedron_public.o):Polyhedron_public.cc:(.text+0xc2c9): undefined
> reference
>  to `std::length_error::length_error(std::basic_string<char,
> std::char_traits<ch
> ar>, std::allocator<char> > const&)'
> [ERROR]
> /usr/ct-ng-1.7/targets/i586-unknown-linux-gnu/build/static/lib/libppl
> .a(Polyhedron_public.o):Polyhedron_public.cc:(.text+0xc3bb): undefined
> reference
>  to `std::length_error::length_error(std::basic_string<char,
> std::char_traits<ch
> ar>, std::allocator<char> > const&)'
> [ERROR]
> /usr/ct-ng-1.7/targets/i586-unknown-linux-gnu/build/static/lib/libppl
> .a(Polyhedron_public.o):Polyhedron_public.cc:(.text+0xc457): undefined
> reference
>  to `std::runtime_error::runtime_error(std::basic_string<char,
> std::char_traits<
> char>, std::allocator<char> > const&)'
> [ERROR]
> /usr/ct-ng-1.7/targets/i586-unknown-linux-gnu/build/static/lib/libppl
> .a(Polyhedron_public.o):Polyhedron_public.cc:(.text+0xc467): undefined
> reference
>  to `std::runtime_error::~runtime_error()'
> [ERROR]
> /usr/ct-ng-1.7/targets/i586-unknown-linux-gnu/build/static/lib/libppl
> .a(Polyhedron_public.o):Polyhedron_public.cc:(.text+0xc68a): undefined
> reference
>  to `std::runtime_error::runtime_error(std::basic_string<char,
> std::char_traits<
> char>, std::allocator<char> > const&)'
> [ERROR]
> /usr/ct-ng-1.7/targets/i586-unknown-linux-gnu/build/static/lib/libppl
> .a(Polyhedron_public.o):Polyhedron_public.cc:(.text+0xc69a): undefined
> reference
>  to `std::runtime_error::~runtime_error()'
> [ERROR]
> /usr/ct-ng-1.7/targets/i586-unknown-linux-gnu/build/static/lib/libppl
> .a(Polyhedron_public.o):Polyhedron_public.cc:(.text+0xc70e): undefined
> reference
>  to `std::runtime_error::runtime_error(std::basic_string<char,
> std::char_traits<
> char>, std::allocator<char> > const&)'
> [ERROR]
> /usr/ct-ng-1.7/targets/i586-unknown-linux-gnu/build/static/lib/libppl
> .a(Polyhedron_public.o):Polyhedron_public.cc:(.text+0xc71e): undefined
> reference
>  to `std::runtime_error::~runtime_error()'
> [ERROR]
> /usr/ct-ng-1.7/targets/i586-unknown-linux-gnu/build/static/lib/libppl
> .a(Polyhedron_public.o):Polyhedron_public.cc:(.text+0xcf36): undefined
> reference
>  to `std::length_error::length_error(std::basic_string<char,
> std::char_traits<ch
> ar>, std::allocator<char> > const&)'
> [ERROR]
> /usr/ct-ng-1.7/targets/i586-unknown-linux-gnu/build/static/lib/libppl
> .a(Polyhedron_public.o):Polyhedron_public.cc:(.text+0xd028): undefined
> reference
>  to `std::length_error::length_error(std::basic_string<char,
> std::char_traits<ch
> ar>, std::allocator<char> > const&)'
> [ERROR]
> /usr/ct-ng-1.7/targets/i586-unknown-linux-gnu/build/static/lib/libppl
> .a(Polyhedron_public.o):Polyhedron_public.cc:(.text+0xd0eb): undefined
> reference
>  to `std::runtime_error::runtime_error(std::basic_string<char,
> std::char_traits<
> char>, std::allocator<char> > const&)'
> [ERROR]
> /usr/ct-ng-1.7/targets/i586-unknown-linux-gnu/build/static/lib/libppl
> .a(Polyhedron_public.o):Polyhedron_public.cc:(.text+0xd101): undefined
> reference
>  to `std::runtime_error::~runtime_error()'
> [ERROR]
> /usr/ct-ng-1.7/targets/i586-unknown-linux-gnu/build/static/lib/libppl
> .a(Polyhedron_public.o):Polyhedron_public.cc:(.text+0xd61b): undefined
> reference
>  to `std::runtime_error::runtime_error(std::basic_string<char,
> std::char_traits<
> char>, std::allocator<char> > const&)'
> [ERROR]
> /usr/ct-ng-1.7/targets/i586-unknown-linux-gnu/build/static/lib/libppl
> .a(Polyhedron_public.o):Polyhedron_public.cc:(.text+0xd62b): undefined
> reference
>  to `std::runtime_error::~runtime_error()'
> [ERROR]
> /usr/ct-ng-1.7/targets/i586-unknown-linux-gnu/build/static/lib/libppl
> .a(MIP_Problem.o):MIP_Problem.cc:(.text+0xe02): undefined reference to
> `std::len
> gth_error::length_error(std::basic_string<char, std::char_traits<char>,
> std::all
> ocator<char> > const&)'
> [ERROR]
> /usr/ct-ng-1.7/targets/i586-unknown-linux-gnu/build/static/lib/libppl
> .a(MIP_Problem.o):MIP_Problem.cc:(.text+0x1224): undefined reference to
> `std::le
> ngth_error::length_error(std::basic_string<char, std::char_traits<char>,
> std::al
> locator<char> > const&)'
> [ERROR]
> /usr/ct-ng-1.7/targets/i586-unknown-linux-gnu/build/static/lib/libppl
> .a(MIP_Problem.o):MIP_Problem.cc:(.text+0x14a4): undefined reference to
> `std::le
> ngth_error::length_error(std::basic_string<char, std::char_traits<char>,
> std::al
> locator<char> > const&)'
> [ERROR]
> /usr/ct-ng-1.7/targets/i586-unknown-linux-gnu/build/static/lib/libppl
> .a(MIP_Problem.o):MIP_Problem.cc:(.text+0x4130): undefined reference to
> `std::le
> ngth_error::length_error(std::basic_string<char, std::char_traits<char>,
> std::al
> locator<char> > const&)'
> [ERROR]
> /usr/ct-ng-1.7/targets/i586-unknown-linux-gnu/build/static/lib/libppl
> .a(MIP_Problem.o):MIP_Problem.cc:(.text+0x4af0): undefined reference to
> `std::le
> ngth_error::length_error(std::basic_string<char, std::char_traits<char>,
> std::al
> locator<char> > const&)'
> [ERROR]
> /usr/ct-ng-1.7/targets/i586-unknown-linux-gnu/build/static/lib/libppl
> .a(MIP_Problem.o):MIP_Problem.cc:(.text+0x840a): undefined reference to
> `std::ru
> ntime_error::runtime_error(std::basic_string<char, std::char_traits<char>,
> std::
> allocator<char> > const&)'
> [ERROR]
> /usr/ct-ng-1.7/targets/i586-unknown-linux-gnu/build/static/lib/libppl
> .a(MIP_Problem.o):MIP_Problem.cc:(.text+0x842a): undefined reference to
> `std::ru
> ntime_error::~runtime_error()'
> [ERROR]
> /usr/ct-ng-1.7/targets/i586-unknown-linux-gnu/build/static/lib/libppl
> .a(MIP_Problem.o):MIP_Problem.cc:(.text+0x8a0c): undefined reference to
> `std::ru
> ntime_error::runtime_error(std::basic_string<char, std::char_traits<char>,
> std::
> allocator<char> > const&)'
> [ERROR]
> /usr/ct-ng-1.7/targets/i586-unknown-linux-gnu/build/static/lib/libppl
> .a(MIP_Problem.o):MIP_Problem.cc:(.text+0x8a2c): undefined reference to
> `std::ru
> ntime_error::~runtime_error()'
> [ERROR]
> /usr/ct-ng-1.7/targets/i586-unknown-linux-gnu/build/static/lib/libppl
> .a(MIP_Problem.o):MIP_Problem.cc:(.text+0x8c70): undefined reference to
> `std::do
> main_error::domain_error(std::basic_string<char, std::char_traits<char>,
> std::al
> locator<char> > const&)'
> [ERROR]
> /usr/ct-ng-1.7/targets/i586-unknown-linux-gnu/build/static/lib/libppl
> .a(MIP_Problem.o):MIP_Problem.cc:(.text+0x94cb): undefined reference to
> `std::ru
> ntime_error::runtime_error(std::basic_string<char, std::char_traits<char>,
> std::
> allocator<char> > const&)'
> [ERROR]
> /usr/ct-ng-1.7/targets/i586-unknown-linux-gnu/build/static/lib/libppl
> .a(MIP_Problem.o):MIP_Problem.cc:(.text+0x94eb): undefined reference to
> `std::ru
> ntime_error::~runtime_error()'
> [ERROR]
> /usr/ct-ng-1.7/targets/i586-unknown-linux-gnu/build/static/lib/libppl
> .a(MIP_Problem.o):MIP_Problem.cc:(.text+0x9840): undefined reference to
> `std::do
> main_error::domain_error(std::basic_string<char, std::char_traits<char>,
> std::al
> locator<char> > const&)'
> [ERROR]
> /usr/ct-ng-1.7/targets/i586-unknown-linux-gnu/build/static/lib/libppl
> .a(Polyhedron_widenings.o):Polyhedron_widenings.cc:(.text$_ZN23Parma_Polyhedra_L
> ibrary3BoxINS_8IntervalI10__gmp_exprIA1_12__mpq_structS4_ENS_25Interval_Restrict
> ion_NoneINS_20Interval_Info_BitsetIjNS_29Rational_Interval_Info_PolicyEEEEEEEE30
> throw_space_dimension_overflowEPKcSE_[Parma_Polyhedra_Library::Box<Parma_Polyhed
> ra_Library::Interval<__gmp_expr<__mpq_struct [1], __mpq_struct [1]>,
> Parma_Polyh
> edra_Library::Interval_Restriction_None<Parma_Polyhedra_Library::Interval_Info_B
> itset<unsigned int,
> Parma_Polyhedra_Library::Rational_Interval_Info_Policy> > >
>>::throw_space_dimension_overflow(char const*, char const*)]+0x139):
> undefined r
> eference to `std::length_error::length_error(std::basic_string<char,
> std::char_t
> raits<char>, std::allocator<char> > const&)'
> [ERROR]
> /usr/ct-ng-1.7/targets/i586-unknown-linux-gnu/build/static/lib/libppl
> .a(BD_Shape.o):BD_Shape.cc:(.text+0x440): undefined reference to
> `std::length_er
> ror::length_error(std::basic_string<char, std::char_traits<char>,
> std::allocator
> <char> > const&)'
> [ERROR]
> /usr/ct-ng-1.7/targets/i586-unknown-linux-gnu/build/static/lib/libppl
> .a(BD_Shape.o):BD_Shape.cc:(.text+0x6c2): undefined reference to
> `std::length_er
> ror::length_error(std::basic_string<char, std::char_traits<char>,
> std::allocator
> <char> > const&)'
> [ERROR]
> /usr/ct-ng-1.7/targets/i586-unknown-linux-gnu/build/static/lib/libppl
> .a(BD_Shape.o):BD_Shape.cc:(.text+0x722): undefined reference to
> `std::length_er
> ror::length_error(std::basic_string<char, std::char_traits<char>,
> std::allocator
> <char> > const&)'
> [ERROR]
> /usr/ct-ng-1.7/targets/i586-unknown-linux-gnu/build/static/lib/libppl
> .a(BD_Shape.o):BD_Shape.cc:(.text+0x782): undefined reference to
> `std::length_er
> ror::length_error(std::basic_string<char, std::char_traits<char>,
> std::allocator
> <char> > const&)'
> [ERROR]
> /usr/ct-ng-1.7/targets/i586-unknown-linux-gnu/build/static/lib/libppl
> .a(Grid_Generator.o):Grid_Generator.cc:(.text+0x1271): undefined reference
> to `s
> td::length_error::length_error(std::basic_string<char,
> std::char_traits<char>, s
> td::allocator<char> > const&)'
> [ERROR]
> /usr/ct-ng-1.7/targets/i586-unknown-linux-gnu/build/static/lib/libppl
> .a(Polyhedron_chdims.o):Polyhedron_chdims.cc:(.text+0x1084): undefined
> reference
>  to `std::length_error::length_error(std::basic_string<char,
> std::char_traits<ch
> ar>, std::allocator<char> > const&)'
> [ERROR]
> /usr/ct-ng-1.7/targets/i586-unknown-linux-gnu/build/static/lib/libppl
> .a(Polyhedron_chdims.o):Polyhedron_chdims.cc:(.text+0x2182): undefined
> reference
>  to `std::length_error::length_error(std::basic_string<char,
> std::char_traits<ch
> ar>, std::allocator<char> > const&)'
> [ERROR]
> /usr/ct-ng-1.7/targets/i586-unknown-linux-gnu/build/static/lib/libppl
> .a(Polyhedron_chdims.o):Polyhedron_chdims.cc:(.text+0x21f5): undefined
> reference
>  to `std::length_error::length_error(std::basic_string<char,
> std::char_traits<ch
> ar>, std::allocator<char> > const&)'
> [ERROR]
> /usr/ct-ng-1.7/targets/i586-unknown-linux-gnu/build/static/lib/libppl
> .a(Polyhedron_chdims.o):Polyhedron_chdims.cc:(.text+0x2260): undefined
> reference
>  to `std::length_error::length_error(std::basic_string<char,
> std::char_traits<ch
> ar>, std::allocator<char> > const&)'
> [ERROR]
> /usr/ct-ng-1.7/targets/i586-unknown-linux-gnu/build/static/lib/libppl
> .a(Polyhedron_chdims.o):Polyhedron_chdims.cc:(.text+0x2511): undefined
> reference
>  to `std::length_error::length_error(std::basic_string<char,
> std::char_traits<ch
> ar>, std::allocator<char> > const&)'
> [ERROR]
> /usr/ct-ng-1.7/targets/i586-unknown-linux-gnu/build/static/lib/libppl
> .a(Pointset_Powerset.o):Pointset_Powerset.cc:(.text$_ZN23Parma_Polyhedra_Library
> 14Implementation18Pointset_Powersets20linear_partition_auxINS_14NNC_PolyhedronEE
> EvRKNS_10ConstraintERT_RNS_17Pointset_PowersetIS3_EE[void
> Parma_Polyhedra_Librar
> y::Implementation::Pointset_Powersets::linear_partition_aux<Parma_Polyhedra_Libr
> ary::NNC_Polyhedron>(Parma_Polyhedra_Library::Constraint const&,
> Parma_Polyhedra
> _Library::NNC_Polyhedron&,
> Parma_Polyhedra_Library::Pointset_Powerset<Parma_Poly
> hedra_Library::NNC_Polyhedron>&)]+0x1a6): undefined reference to
> `std::length_er
> ror::length_error(std::basic_string<char, std::char_traits<char>,
> std::allocator
> <char> > const&)'
> [ERROR]
> /usr/ct-ng-1.7/targets/i586-unknown-linux-gnu/build/static/lib/libppl
> .a(BHRZ03_Certificate.o):BHRZ03_Certificate.cc:(.text+0x372): undefined
> referenc
> e to `std::length_error::length_error(std::basic_string<char,
> std::char_traits<c
> har>, std::allocator<char> > const&)'
> [ERROR]
> /usr/ct-ng-1.7/targets/i586-unknown-linux-gnu/build/static/lib/libppl
> .a(BHRZ03_Certificate.o):BHRZ03_Certificate.cc:(.text+0x720): undefined
> referenc
> e to `std::length_error::length_error(std::basic_string<char,
> std::char_traits<c
> har>, std::allocator<char> > const&)'
> [ERROR]
> /usr/ct-ng-1.7/targets/i586-unknown-linux-gnu/build/static/lib/libppl
> .a(BHRZ03_Certificate.o):BHRZ03_Certificate.cc:(.text+0xa50): undefined
> referenc
> e to `std::length_error::length_error(std::basic_string<char,
> std::char_traits<c
> har>, std::allocator<char> > const&)'
> [ERROR]
> /usr/ct-ng-1.7/targets/i586-unknown-linux-gnu/build/static/lib/libppl
> .a(minimize.o):minimize.cc:(.text+0x31e): undefined reference to
> `std::runtime_e
> rror::runtime_error(std::basic_string<char, std::char_traits<char>,
> std::allocat
> or<char> > const&)'
> [ERROR]
> /usr/ct-ng-1.7/targets/i586-unknown-linux-gnu/build/static/lib/libppl
> .a(minimize.o):minimize.cc:(.text+0x33a): undefined reference to
> `std::runtime_e
> rror::~runtime_error()'
> [ERROR]
> /usr/ct-ng-1.7/targets/i586-unknown-linux-gnu/build/static/lib/libppl
> .a(minimize.o):minimize.cc:(.text+0x542): undefined reference to
> `std::runtime_e
> rror::runtime_error(std::basic_string<char, std::char_traits<char>,
> std::allocat
> or<char> > const&)'
> [ERROR]
> /usr/ct-ng-1.7/targets/i586-unknown-linux-gnu/build/static/lib/libppl
> .a(minimize.o):minimize.cc:(.text+0x55e): undefined reference to
> `std::runtime_e
> rror::~runtime_error()'
> [ERROR]
> /usr/ct-ng-1.7/targets/i586-unknown-linux-gnu/build/static/lib/libppl
> .a(Variables_Set.o):Variables_Set.cc:(.text+0x4f4): undefined reference to
> `std:
> :length_error::length_error(std::basic_string<char,
> std::char_traits<char>, std:
> :allocator<char> > const&)'
> [ERROR]
> /usr/ct-ng-1.7/targets/i586-unknown-linux-gnu/build/static/lib/libppl
> .a(Variables_Set.o):Variables_Set.cc:(.text+0x6ec): undefined reference to
> `std:
> :length_error::length_error(std::basic_string<char,
> std::char_traits<char>, std:
> :allocator<char> > const&)'
> [ERROR]
> /usr/ct-ng-1.7/targets/i586-unknown-linux-gnu/build/static/lib/libppl
> .a(Grid_nonpublic.o):Grid_nonpublic.cc:(.text+0xdff): undefined reference
> to `st
> d::length_error::length_error(std::basic_string<char,
> std::char_traits<char>, st
> d::allocator<char> > const&)'
> [ERROR]
> /usr/ct-ng-1.7/targets/i586-unknown-linux-gnu/build/static/lib/libppl
> .a(Grid_nonpublic.o):Grid_nonpublic.cc:(.text+0x1738): undefined reference
> to `s
> td::runtime_error::runtime_error(std::basic_string<char,
> std::char_traits<char>,
>  std::allocator<char> > const&)'
> [ERROR]
> /usr/ct-ng-1.7/targets/i586-unknown-linux-gnu/build/static/lib/libppl
> .a(Grid_nonpublic.o):Grid_nonpublic.cc:(.text+0x1754): undefined reference
> to `s
> td::runtime_error::~runtime_error()'
> [ERROR]
> /usr/ct-ng-1.7/targets/i586-unknown-linux-gnu/build/static/lib/libppl
> .a(Grid_nonpublic.o):Grid_nonpublic.cc:(.text+0x21c1): undefined reference
> to `s
> td::length_error::length_error(std::basic_string<char,
> std::char_traits<char>, s
> td::allocator<char> > const&)'
> [ERROR]
> /usr/ct-ng-1.7/targets/i586-unknown-linux-gnu/build/static/lib/libppl
> .a(Grid_nonpublic.o):Grid_nonpublic.cc:(.text+0x32f6): undefined reference
> to `s
> td::length_error::length_error(std::basic_string<char,
> std::char_traits<char>, s
> td::allocator<char> > const&)'
> [ERROR]
> /usr/ct-ng-1.7/targets/i586-unknown-linux-gnu/build/static/lib/libppl
> .a(Grid_conversion.o):Grid_conversion.cc:(.text+0x49c): undefined
> reference to `
> std::runtime_error::runtime_error(std::basic_string<char,
> std::char_traits<char>
> , std::allocator<char> > const&)'
> [ERROR]
> /usr/ct-ng-1.7/targets/i586-unknown-linux-gnu/build/static/lib/libppl
> .a(Grid_conversion.o):Grid_conversion.cc:(.text+0x4bc): undefined
> reference to `
> std::runtime_error::~runtime_error()'
> [ERROR]
> /usr/ct-ng-1.7/targets/i586-unknown-linux-gnu/build/static/lib/libppl
> .a(Grid_conversion.o):Grid_conversion.cc:(.text+0xae3): undefined
> reference to `
> std::runtime_error::runtime_error(std::basic_string<char,
> std::char_traits<char>
> , std::allocator<char> > const&)'
> [ERROR]
> /usr/ct-ng-1.7/targets/i586-unknown-linux-gnu/build/static/lib/libppl
> .a(Grid_conversion.o):Grid_conversion.cc:(.text+0xb03): undefined
> reference to `
> std::runtime_error::~runtime_error()'
> [ERROR]
> /usr/ct-ng-1.7/targets/i586-unknown-linux-gnu/build/static/lib/libppl
> .a(Grid_chdims.o):Grid_chdims.cc:(.text+0x4b0): undefined reference to
> `std::len
> gth_error::length_error(std::basic_string<char, std::char_traits<char>,
> std::all
> ocator<char> > const&)'
> [ERROR]
> /usr/ct-ng-1.7/targets/i586-unknown-linux-gnu/build/static/lib/libppl
> .a(Grid_chdims.o):Grid_chdims.cc:(.text+0x851): undefined reference to
> `std::len
> gth_error::length_error(std::basic_string<char, std::char_traits<char>,
> std::all
> ocator<char> > const&)'
> [ERROR]
> /usr/ct-ng-1.7/targets/i586-unknown-linux-gnu/build/static/lib/libppl
> .a(Grid_chdims.o):Grid_chdims.cc:(.text+0x18d0): undefined reference to
> `std::le
> ngth_error::length_error(std::basic_string<char, std::char_traits<char>,
> std::al
> locator<char> > const&)'
> [ERROR]
> /usr/ct-ng-1.7/targets/i586-unknown-linux-gnu/build/static/lib/libppl
> .a(Grid_chdims.o):Grid_chdims.cc:(.text+0x1c57): undefined reference to
> `std::le
> ngth_error::length_error(std::basic_string<char, std::char_traits<char>,
> std::al
> locator<char> > const&)'
> [ERROR]
> /usr/ct-ng-1.7/targets/i586-unknown-linux-gnu/build/static/lib/libppl
> .a(Grid_chdims.o):Grid_chdims.cc:(.text+0x1d15): undefined reference to
> `std::le
> ngth_error::length_error(std::basic_string<char, std::char_traits<char>,
> std::al
> locator<char> > const&)'
> [ERROR]
> /usr/ct-ng-1.7/targets/i586-unknown-linux-gnu/build/static/lib/libppl
> .a(Box.o):Box.cc:(.text+0xb0): undefined reference to
> `std::length_error::length
> _error(std::basic_string<char, std::char_traits<char>,
> std::allocator<char> > co
> nst&)'
> [ERROR]
> /usr/ct-ng-1.7/targets/i586-unknown-linux-gnu/build/static/lib/libppl
> .a(Box.o):Box.cc:(.text+0x5a2): undefined reference to
> `std::length_error::lengt
> h_error(std::basic_string<char, std::char_traits<char>,
> std::allocator<char> > c
> onst&)'
> [ERROR]    make[2]: *** [cc1-dummy.exe] Error 1
> [ERROR]    make[1]: *** [all-gcc] Error 2
> [ERROR]    Build failed in step 'Installing static core C compiler'
> [ERROR]    Error happened in
> '/usr/ct-ng-1.7-run/lib/ct-ng-hg_default@1943_48e10
> 7b35ba9/scripts/functions' in function 'CT_DoExecLog' (line unknown,
> sorry)
> [ERROR]          called from
> '/usr/ct-ng-1.7-run/lib/ct-ng-hg_default@1943_48e10
> 7b35ba9/scripts/build/cc/gcc.sh' at line # 261 in function 'do_cc_core'
> [ERROR]          called from
> '/usr/ct-ng-1.7-run/lib/ct-ng-hg_default@1943_48e10
> 7b35ba9/scripts/build/cc/gcc.sh' at line # 52 in function
> 'do_cc_core_pass_1'
> [ERROR]          called from
> '/usr/ct-ng-1.7-run/lib/ct-ng-hg_default@1943_48e10
> 7b35ba9/scripts/crosstool-NG.sh' at line # 578 in function 'main'
> [ERROR]    Look at
> '/home/Matthias/x-tools/i586-unknown-linux-gnu/build.log' for
>  more info on this error.
> [ERROR]  (elapsed: 226:08.92)
> [226:18] / make: *** [build] Error 2
>
> thank you,
>
> matthias--
> For unsubscribe information see http://sourceware.org/lists.html#faq



--
For unsubscribe information see http://sourceware.org/lists.html#faq



More information about the crossgcc mailing list