build failure of gold (trunk)

Gabriel Dos Reis gdr@cs.tamu.edu
Fri Mar 4 17:02:00 GMT 2011


Hi Ian,

A fresh check out of CVS gold fails to build with the following error:

In file included from
/home/gdr/src/sourceware/src/gold/expression.cc:33:0:
/home/gdr/src/sourceware/src/gold/script-c.h:221:7: error: ‘yylex’ initialized and declared ‘extern’
/home/gdr/src/sourceware/src/gold/script-c.h:221:7: error: ‘YYSTYPE’ was not declared in this scope
/home/gdr/src/sourceware/src/gold/script-c.h:221:15: error: expected primary-expression before ‘,’ token
/home/gdr/src/sourceware/src/gold/script-c.h:221:17: error: expected primary-expression before ‘void’
/home/gdr/src/sourceware/src/gold/script-c.h:221:30: error: initializer expression list treated as compound expression


this is with GCC-4.5.0.

-- Gaby



More information about the Binutils mailing list