This is the mail archive of the
gdb-testers@sourceware.org
mailing list for the GDB project.
*** COMPILATION FAILED *** Failures on Fedora-x86_64-c-build-m64, branch gdb-7.12-branch *** BREAKAGE ***
- From: sergiodj+buildbot at sergiodj dot net
- To: gdb-testers at sourceware dot org
- Date: Tue, 20 Dec 2016 13:14:31 -0500
- Subject: *** COMPILATION FAILED *** Failures on Fedora-x86_64-c-build-m64, branch gdb-7.12-branch *** BREAKAGE ***
- Authentication-results: sourceware.org; auth=none
Buildslave:
fedora-x86-64-4
Full Build URL:
<http://gdb-build.sergiodj.net/builders/Fedora-x86_64-c-build-m64/builds/941>
Commit(s) tested:
ada8ff522ce970e11dae4a3463c899b64e6f5006
Author(s) (in the same order as the commits):
Pedro Alves <palves@redhat.com>
Subject:
Fix longjmp across readline w/ --enable-sjlj-exceptions toolchains
Testsuite log (gdb.sum and gdb.log) URL(s):
<http://gdb-build.sergiodj.net/results/Fedora-x86_64-c-build-m64/ad/ada8ff522ce970e11dae4a3463c899b64e6f5006/>
*** Failed to compiled GDB. ***
============================
+++ The full log is too big to be posted here.
+++ These are the last 100 lines of it.
^
../../binutils-gdb/gdb/event-top.c:1162:1: error: expected =, ,, ;, asm or __attribute__ before { token
{
^
../../binutils-gdb/gdb/event-top.c:1173:1: error: expected =, ,, ;, asm or __attribute__ before { token
{
^
../../binutils-gdb/gdb/event-top.c:1183:1: error: expected =, ,, ;, asm or __attribute__ before { token
{
^
../../binutils-gdb/gdb/event-top.c:1191:1: error: expected =, ,, ;, asm or __attribute__ before { token
{
^
../../binutils-gdb/gdb/event-top.c:1223:1: error: expected =, ,, ;, asm or __attribute__ before { token
{
^
../../binutils-gdb/gdb/event-top.c:1230:1: error: expected =, ,, ;, asm or __attribute__ before { token
{
^
../../binutils-gdb/gdb/event-top.c:1263:1: error: expected =, ,, ;, asm or __attribute__ before { token
{
^
../../binutils-gdb/gdb/event-top.c:1271:1: error: expected =, ,, ;, asm or __attribute__ before { token
{
^
../../binutils-gdb/gdb/event-top.c:1285:1: error: expected =, ,, ;, asm or __attribute__ before { token
{
^
../../binutils-gdb/gdb/event-top.c:1335:1: error: expected =, ,, ;, asm or __attribute__ before { token
{
^
../../binutils-gdb/gdb/event-top.c:165:1: warning: old-style function definition [-Wold-style-definition]
gdb_rl_callback_read_char_wrapper_noexcept () noexcept
^~~~~~~~~~~~~~~~~~~~~~~~~~~~~~~~~~~~~~~~~~
../../binutils-gdb/gdb/event-top.c:1131:14: error: declaration for parameter sync_quit_force_run but no such parameter
volatile int sync_quit_force_run;
^~~~~~~~~~~~~~~~~~~
../../binutils-gdb/gdb/event-top.c:1021:21: error: declaration for parameter quit_handler but no such parameter
quit_handler_ftype *quit_handler = default_quit_handler;
^~~~~~~~~~~~
../../binutils-gdb/gdb/event-top.c:916:29: error: declaration for parameter quit_serial_event but no such parameter
static struct serial_event *quit_serial_event;
^~~~~~~~~~~~~~~~~
../../binutils-gdb/gdb/event-top.c:461:12: error: declaration for parameter ui_list but no such parameter
struct ui *ui_list;
^~~~~~~
../../binutils-gdb/gdb/event-top.c:460:12: error: declaration for parameter current_ui but no such parameter
struct ui *current_ui;
^~~~~~~~~~
../../binutils-gdb/gdb/event-top.c:459:12: error: declaration for parameter main_ui but no such parameter
struct ui *main_ui;
^~~~~~~
../../binutils-gdb/gdb/event-top.c:289:12: error: declaration for parameter callback_handler_installed but no such parameter
static int callback_handler_installed;
^~~~~~~~~~~~~~~~~~~~~~~~~~
../../binutils-gdb/gdb/event-top.c:1354:1: error: expected { at end of input
}
^
../../binutils-gdb/gdb/event-top.c:1354:1: warning: no return statement in function returning non-void [-Wreturn-type]
../../binutils-gdb/gdb/event-top.c: At top level:
../../binutils-gdb/gdb/event-top.c:51:14: warning: top_level_prompt declared static but never defined [-Wunused-function]
static char *top_level_prompt (void);
^~~~~~~~~~~~~~~~
../../binutils-gdb/gdb/event-top.c:55:13: warning: handle_sigquit declared static but never defined [-Wunused-function]
static void handle_sigquit (int sig);
^~~~~~~~~~~~~~
../../binutils-gdb/gdb/event-top.c:58:13: warning: handle_sighup declared static but never defined [-Wunused-function]
static void handle_sighup (int sig);
^~~~~~~~~~~~~
../../binutils-gdb/gdb/event-top.c:60:13: warning: handle_sigfpe declared static but never defined [-Wunused-function]
static void handle_sigfpe (int sig);
^~~~~~~~~~~~~
../../binutils-gdb/gdb/event-top.c:65:13: warning: async_do_nothing declared static but never defined [-Wunused-function]
static void async_do_nothing (gdb_client_data);
^~~~~~~~~~~~~~~~
../../binutils-gdb/gdb/event-top.c:68:13: warning: async_disconnect declared static but never defined [-Wunused-function]
static void async_disconnect (gdb_client_data);
^~~~~~~~~~~~~~~~
../../binutils-gdb/gdb/event-top.c:70:13: warning: async_float_handler declared static but never defined [-Wunused-function]
static void async_float_handler (gdb_client_data);
^~~~~~~~~~~~~~~~~~~
../../binutils-gdb/gdb/event-top.c:72:13: warning: async_stop_sig declared static but never defined [-Wunused-function]
static void async_stop_sig (gdb_client_data);
^~~~~~~~~~~~~~
../../binutils-gdb/gdb/event-top.c:74:13: warning: async_sigterm_handler declared static but never defined [-Wunused-function]
static void async_sigterm_handler (gdb_client_data arg);
^~~~~~~~~~~~~~~~~~~~~
../../binutils-gdb/gdb/event-top.c:165:1: warning: gdb_rl_callback_read_char_wrapper_noexcept defined but not used [-Wunused-function]
gdb_rl_callback_read_char_wrapper_noexcept () noexcept
^~~~~~~~~~~~~~~~~~~~~~~~~~~~~~~~~~~~~~~~~~
Makefile:1146: recipe for target 'event-top.o' failed
make[2]: *** [event-top.o] Error 1
make[2]: *** Waiting for unfinished jobs....
make[2]: Leaving directory '/home/gdb-buildbot-2/fedora-x86-64-4/fedora-x86-64-c-build/build/gdb'
Makefile:8827: recipe for target 'all-gdb' failed
make[1]: *** [all-gdb] Error 2
make[1]: Leaving directory '/home/gdb-buildbot-2/fedora-x86-64-4/fedora-x86-64-c-build/build'
Makefile:850: recipe for target 'all' failed
make: *** [all] Error 2
============================