This is the mail archive of the
gdb-testers@sourceware.org
mailing list for the GDB project.
*** COMPILATION FAILED *** Failures on Ubuntu-AArch64-native-gdbserver-m64, branch master *** BREAKAGE ***
- From: sergiodj+buildbot at sergiodj dot net
- To: gdb-testers at sourceware dot org
- Date: Tue, 08 Nov 2016 07:34:48 -0500
- Subject: *** COMPILATION FAILED *** Failures on Ubuntu-AArch64-native-gdbserver-m64, branch master *** BREAKAGE ***
- Authentication-results: sourceware.org; auth=none
Buildslave:
ubuntu-aarch64-1
Full Build URL:
<http://gdb-build.sergiodj.net/builders/Ubuntu-AArch64-native-gdbserver-m64/builds/773>
Commit(s) tested:
089e3718bd8de11fc4d6bbc8d32701033d467960
Author(s) (in the same order as the commits):
Igor Tsimbalist <tigor.tools@gmail.com>
Subject:
Greatly improve the speed if looking up DWARF line number information.
Testsuite log (gdb.sum and gdb.log) URL(s):
<Error fetching commit ID for 089e3718bd8de11fc4d6bbc8d32701033d467960>
*** Failed to compiled GDB. ***
============================
+++ The full log is too big to be posted here.
+++ These are the last 100 lines of it.
../../binutils-gdb/bfd/dwarf2.c:4052:33: error: struct funcinfo has no member named name
&& strcmp (sym->name, func->name) == 0)
^
../../binutils-gdb/bfd/dwarf2.c:4052:33: error: struct funcinfo has no member named name
&& strcmp (sym->name, func->name) == 0)
^
../../binutils-gdb/bfd/dwarf2.c:4052:33: error: struct funcinfo has no member named name
&& strcmp (sym->name, func->name) == 0)
^
../../binutils-gdb/bfd/dwarf2.c:4052:33: error: struct funcinfo has no member named name
&& strcmp (sym->name, func->name) == 0)
^
../../binutils-gdb/bfd/dwarf2.c:4052:33: error: struct funcinfo has no member named name
&& strcmp (sym->name, func->name) == 0)
^
../../binutils-gdb/bfd/dwarf2.c:4052:33: error: struct funcinfo has no member named name
&& strcmp (sym->name, func->name) == 0)
^
../../binutils-gdb/bfd/dwarf2.c:4052:33: error: struct funcinfo has no member named name
&& strcmp (sym->name, func->name) == 0)
^
../../binutils-gdb/bfd/dwarf2.c:4052:33: error: struct funcinfo has no member named name
&& strcmp (sym->name, func->name) == 0)
^
../../binutils-gdb/bfd/dwarf2.c:4052:33: error: struct funcinfo has no member named name
&& strcmp (sym->name, func->name) == 0)
^
../../binutils-gdb/bfd/dwarf2.c:4052:33: error: struct funcinfo has no member named name
&& strcmp (sym->name, func->name) == 0)
^
../../binutils-gdb/bfd/dwarf2.c:4052:33: error: struct funcinfo has no member named name
&& strcmp (sym->name, func->name) == 0)
^
../../binutils-gdb/bfd/dwarf2.c:4052:33: error: struct funcinfo has no member named name
&& strcmp (sym->name, func->name) == 0)
^
mv -f .deps/elf-eh-frame.Tpo .deps/elf-eh-frame.Plo
../../binutils-gdb/bfd/dwarf2.c:4052:33: error: struct funcinfo has no member named name
&& strcmp (sym->name, func->name) == 0)
^
../../binutils-gdb/bfd/dwarf2.c:4052:33: error: struct funcinfo has no member named name
&& strcmp (sym->name, func->name) == 0)
^
../../binutils-gdb/bfd/dwarf2.c:4052:33: error: struct funcinfo has no member named name
&& strcmp (sym->name, func->name) == 0)
^
../../binutils-gdb/bfd/dwarf2.c:4052:33: error: struct funcinfo has no member named name
&& strcmp (sym->name, func->name) == 0)
^
/bin/bash ./libtool --tag=CC --mode=compile gcc -DHAVE_CONFIG_H -I. -I../../binutils-gdb/bfd -I. -I../../binutils-gdb/bfd -I../../binutils-gdb/bfd/../include -DHAVE_all_vecs -DBINDIR='"/usr/local/bin"' -W -Wall -Wstrict-prototypes -Wmissing-prototypes -Wshadow -Werror -I../../binutils-gdb/bfd/../zlib -g -O2 -MT elf32-aarch64.lo -MD -MP -MF .deps/elf32-aarch64.Tpo -c -o elf32-aarch64.lo elf32-aarch64.c
../../binutils-gdb/bfd/dwarf2.c:4052:33: error: struct funcinfo has no member named name
&& strcmp (sym->name, func->name) == 0)
^
../../binutils-gdb/bfd/dwarf2.c:4052:33: error: struct funcinfo has no member named name
&& strcmp (sym->name, func->name) == 0)
^
../../binutils-gdb/bfd/dwarf2.c:4052:33: error: struct funcinfo has no member named name
&& strcmp (sym->name, func->name) == 0)
^
../../binutils-gdb/bfd/dwarf2.c:4052:33: error: struct funcinfo has no member named name
&& strcmp (sym->name, func->name) == 0)
^
../../binutils-gdb/bfd/dwarf2.c:4053:34: error: struct funcinfo has no member named arange
return ((bfd_signed_vma) func->arange.low) -
^
../../binutils-gdb/bfd/dwarf2.c: In function _bfd_dwarf2_find_nearest_line:
../../binutils-gdb/bfd/dwarf2.c:4352:20: error: struct funcinfo has no member named is_linkage
if (!function->is_linkage)
^
../../binutils-gdb/bfd/dwarf2.c:4364:43: error: struct funcinfo has no member named arange
&& fun->value + sec_vma == function->arange.low)
^
../../binutils-gdb/bfd/dwarf2.c:4365:14: error: struct funcinfo has no member named name
function->name = *functionname_ptr;
^
../../binutils-gdb/bfd/dwarf2.c:4368:12: error: struct funcinfo has no member named is_linkage
function->is_linkage = TRUE;
^
../../binutils-gdb/bfd/dwarf2.c:4370:35: error: struct funcinfo has no member named name
*functionname_ptr = function->name;
^
../../binutils-gdb/bfd/dwarf2.c: In function _bfd_dwarf2_find_inliner_info:
../../binutils-gdb/bfd/dwarf2.c:4395:41: error: struct funcinfo has no member named name
*functionname_ptr = func->caller_func->name;
^
libtool: compile: gcc -DHAVE_CONFIG_H -I. -I../../binutils-gdb/bfd -I. -I../../binutils-gdb/bfd -I../../binutils-gdb/bfd/../include -DHAVE_all_vecs -DBINDIR=\"/usr/local/bin\" -W -Wall -Wstrict-prototypes -Wmissing-prototypes -Wshadow -Werror -I../../binutils-gdb/bfd/../zlib -g -O2 -MT elf32-aarch64.lo -MD -MP -MF .deps/elf32-aarch64.Tpo -c elf32-aarch64.c -o elf32-aarch64.o
make[4]: *** [dwarf2.lo] Error 1
make[4]: *** Waiting for unfinished jobs....
mv -f .deps/elf.Tpo .deps/elf.Plo
mv -f .deps/elf32-aarch64.Tpo .deps/elf32-aarch64.Plo
mv -f .deps/elflink.Tpo .deps/elflink.Plo
make[4]: Leaving directory `/home/qiyao/buildbot/ubuntu-aarch64-native-gdbserver-m64/build/bfd'
make[3]: *** [all-recursive] Error 1
make[3]: Leaving directory `/home/qiyao/buildbot/ubuntu-aarch64-native-gdbserver-m64/build/bfd'
make[2]: *** [all] Error 2
make[2]: Leaving directory `/home/qiyao/buildbot/ubuntu-aarch64-native-gdbserver-m64/build/bfd'
make[1]: *** [all-bfd] Error 2
make[1]: Leaving directory `/home/qiyao/buildbot/ubuntu-aarch64-native-gdbserver-m64/build'
make: *** [all] Error 2
============================