This is the mail archive of the cygwin mailing list for the Cygwin project.

Index Nav: [Date Index] [Subject Index] [Author Index] [Thread Index]
Message Nav: [Date Prev] [Date Next] [Thread Prev] [Thread Next]
Other format: [Raw text]

Re: Problems building setup from CVS.

Dave Korn wrote:
> _AddAccessAllowedAce@16' 
> autoload.o(.data+0x12c):/usr/build/obj-apps/../apps/setup/autoload.c:83: first d 
> efined here 
> /usr/lib/w32api/libadvapi32.a(dspes00357.o)(.text+0x0): multiple definition of ` 
> _OpenProcessToken@12' 
> autoload.o(.data+0x193):/usr/build/obj-apps/../apps/setup/autoload.c:83: first d 
> efined here 
> /usr/lib/w32api/libadvapi32.a(dspes00479.o)(.text+0x0): multiple definition of ` 
> _SetTokenInformation@16' 
> autoload.o(.data+0x1ad):/usr/build/obj-apps/../apps/setup/autoload.c:83: first d 
> efined here 
> collect2: ld returned 1 exit status 
> make[2]: *** [setup.exe] Error 1 
> make[2]: Leaving directory `/usr/build/obj-apps' 
> make[1]: *** [all-recursive] Error 1 
> make[1]: Leaving directory `/usr/build/obj-apps' 
> make: *** [all] Error 2 
> ------------------------------<s

Are you using w32api version 3.1.1 because I found that once I fixed the 
underquoting problem for aclocal and then tried to build setup with 3.1.1 it still 
failed with the above.  A rollback to w32api version 2.5.1 resolved the above and 
allowed the build to complete.  

Have not had a chance yet to see why the multiple definitions occur with newer 


Unsubscribe info:
Problem reports:

Index Nav: [Date Index] [Subject Index] [Author Index] [Thread Index]
Message Nav: [Date Prev] [Date Next] [Thread Prev] [Thread Next]