This is the mail archive of the mailing list for the Cygwin project.

Index Nav: [Date Index] [Subject Index] [Author Index] [Thread Index]
Message Nav: [Date Prev] [Date Next] [Thread Prev] [Thread Next]
Other format: [Raw text]

CVS b0rked?

    Good morning everyone,

  I'm having problems with the CVS sources: is it just me?

                === winsup Summary ===

# of unexpected failures        263
# of expected failures          14

Binary file
/usr/build/obj/i686-pc-cygwin/winsup/testsuite/../cygwin/cygwin0.dll matches


make[2]: *** [check] Error 1
make[2]: Leaving directory `/usr/build/obj/i686-pc-cygwin/winsup/testsuite'
make[1]: *** [check] Error 2
make[1]: Leaving directory `/usr/build/obj/i686-pc-cygwin/winsup'
make: *** [check-target-winsup] Error 2
dk@mace /usr/build/obj>

  I've been getting this repeatedly and reliably since I first tried
building from the cvs sources last Thursday.  Here's the command sequence
I've been using:

cd /usr/build
cvs -d login
cvs -d -q update
cvs -d logout
mkdir obj
mkdir install
cd obj
../src/configure -v --prefix=/usr/build/install 2>&1 | tee conf.log
make 2>&1 | tee build.log
make install 2>&1 | tee install.log
make check 2>&1 | tee check.log

...and I completely rm the obj and install directories in between attempts.

  Cygcheck -svr output attached.  Don't think it's anything in my setup,
though.  It happens with both 1.5.5-1 (current release) cygwin1.dll and also
with the cygwin1-20040103.dll snapshot.

  Is anyone else having problems ?


Attachment: cygcheck.out
Description: Binary data

Unsubscribe info:
Problem reports:

Index Nav: [Date Index] [Subject Index] [Author Index] [Thread Index]
Message Nav: [Date Prev] [Date Next] [Thread Prev] [Thread Next]