Bug 4139 - make check: Didn't expect signal from child: got `Aborted'
Summary: make check: Didn't expect signal from child: got `Aborted'
Status: RESOLVED DUPLICATE of bug 333
Alias: None
Product: glibc
Classification: Unclassified
Component: libc (show other bugs)
Version: 2.3.4
: P2 normal
Target Milestone: ---
Assignee: Ulrich Drepper
URL:
Keywords:
Depends on:
Blocks:
 
Reported: 2007-03-06 19:11 UTC by Alex
Modified: 2014-07-18 05:28 UTC (History)
1 user (show)

See Also:
Host: i686-pc-linux-gnu 2.6.20
Target: i686-pc-linux-gnu
Build: i686-pc-linux-gnu
Last reconfirmed:
fweimer: security-


Attachments

Note You need to log in before you can comment on or make changes to this bug.
Description Alex 2007-03-06 19:11:42 UTC
Build glibc-2.5
Configure: OK
Make: OK
Make Check: Fail with above message
NOTE:  Stopped here.  Did not continue installation (i.e. make install).

DETAILS
1. Existing software:
glibc 2.3.4
gcc 3.4.3
make 3.81
binutils 2.15.94
etc.

2. Add-ons:
glibc-linuxthreads-2.5

3. Build commands:
cd ../glibc-build
../glibc-2.5/configure --prefix=/usr --with-headers=/linux-2.6.20/include \
--enable-kernel=2.6.19 --enable-add-ons --disable-profile \
--libexecdir=/usr/lib/glib
make
make check

4. Last 'make check' paragrapch:
gcc -nostdlib -nostartfiles -o /usr/src/glibc-build/nptl/tst-cancel1 
-Wl,-dynamic-linker=/lib/ld-linux.so.2   -Wl,-z,combreloc -Wl,-z,relro 
/usr/src/glibc-build/csu/crt1.o /usr/src/glibc-build/csu/crti.o `gcc
--print-file-name=crtbegin.o` /usr/src/glibc-build/nptl/tst-cancel1.o
/usr/src/glibc-build/nptl/libpthread.so
/usr/src/glibc-build/nptl/libpthread_nonshared.a 
-Wl,-rpath-link=/usr/src/glibc-build:/usr/src/glibc-build/math:/usr/src/glibc-build/elf:/usr/src/glibc-build/dlfcn:/usr/src/glibc-build/nss:/usr/src/glibc-build/nis:/usr/src/glibc-build/rt:/usr/src/glibc-build/resolv:/usr/src/glibc-build/crypt:/usr/src/glibc-build/nptl
/usr/src/glibc-build/libc.so.6 /usr/src/glibc-build/libc_nonshared.a -lgcc
-Wl,--as-needed -lgcc_s  -Wl,--no-as-needed `gcc --print-file-name=crtend.o`
/usr/src/glibc-build/csu/crtn.o
GCONV_PATH=/usr/src/glibc-build/iconvdata LC_ALL=C  
/usr/src/glibc-build/elf/ld-linux.so.2 --library-path
/usr/src/glibc-build:/usr/src/glibc-build/math:/usr/src/glibc-build/elf:/usr/src/glibc-build/dlfcn:/usr/src/glibc-build/nss:/usr/src/glibc-build/nis:/usr/src/glibc-build/rt:/usr/src/glibc-build/resolv:/usr/src/glibc-build/crypt:/usr/src/glibc-build/nptl
/usr/src/glibc-build/nptl/tst-cancel1  > /usr/src/glibc-build/nptl/tst-cancel1.out
Didn't expect signal from child: got `Aborted'
make[2]: *** [/usr/src/glibc-build/nptl/tst-cancel1.out] Error 1
make[2]: Leaving directory `/usr/src/glibc-2.5/nptl'
make[1]: *** [nptl/tests] Error 2
make[1]: Leaving directory `/usr/src/glibc-2.5'
make: *** [check] Error 2

5.  Full configure, make and make check logs and any other details
available on request.
Comment 1 Ulrich Drepper 2007-03-06 19:29:58 UTC

*** This bug has been marked as a duplicate of 333 ***