This is the mail archive of the mailing list for the GDB project.

Index Nav: [Date Index] [Subject Index] [Author Index] [Thread Index]
Message Nav: [Date Prev] [Date Next] [Thread Prev] [Thread Next]
Other format: [Raw text]

*** COMPILATION FAILED *** Failures on Debian-s390x-native-extended-gdbserver-m64, branch master *** BREAKAGE ***


Full Build URL:

Commit(s) tested:

Author(s) (in the same order as the commits):
	Alan Hayward <>

	Add linux_get_hwcap

Testsuite log (gdb.sum and gdb.log) URL(s):

*** Failed to compiled GDB.  ***

+++ The full log is too big to be posted here.
+++ These are the last 100 lines of it.

  CXX    ppc-fbsd-tdep.o
  CXX    ppc-linux-tdep.o
  CXX    ppc-nbsd-tdep.o
  CXX    ppc-obsd-tdep.o
  CXX    ppc-ravenscar-thread.o
  CXX    ppc-sysv-tdep.o
  CXX    ppc64-tdep.o
  CXX    printcmd.o
  CXX    probe.o
  CXX    proc-service.o
  CXX    process-stratum-target.o
  CXX    producer.o
  CXX    progspace-and-thread.o
  CXX    progspace.o
  CXX    prologue-value.o
  CXX    psymtab.o
  CXX    python/py-arch.o
  CXX    python/py-auto-load.o
  CXX    python/py-block.o
  CXX    python/py-bpevent.o
  CXX    python/py-breakpoint.o
  CXX    python/py-cmd.o
  CXX    python/py-continueevent.o
  CXX    python/py-event.o
  CXX    python/py-evtregistry.o
  CXX    python/py-evts.o
  CXX    python/py-exitedevent.o
  CXX    python/py-finishbreakpoint.o
  CXX    python/py-frame.o
  CXX    python/py-framefilter.o
  CXX    python/py-function.o
  CXX    python/py-gdb-readline.o
  CXX    python/py-inferior.o
  CXX    python/py-infevents.o
  CXX    python/py-infthread.o
  CXX    python/py-instruction.o
  CXX    python/py-lazy-string.o
  CXX    python/py-linetable.o
  CXX    python/py-newobjfileevent.o
  CXX    python/py-objfile.o
  CXX    python/py-param.o
  CXX    python/py-prettyprint.o
  CXX    python/py-progspace.o
  CXX    python/py-record-btrace.o
  CXX    python/py-record-full.o
  CXX    python/py-record.o
  CXX    python/py-signalevent.o
  CXX    python/py-stopevent.o
  CXX    python/py-symbol.o
  CXX    python/py-symtab.o
  CXX    python/py-threadevent.o
  CXX    python/py-type.o
  CXX    python/py-unwind.o
  CXX    python/py-utils.o
  CXX    python/py-value.o
  CXX    python/py-varobj.o
  CXX    python/py-xmethods.o
  CXX    python/python.o
  CXX    ravenscar-thread.o
  CXX    record-btrace.o
  CXX    record-full.o
  CXX    record.o
  CXX    regcache-dump.o
  CXX    regcache.o
  CXX    reggroups.o
  CXX    registry.o
  CXX    remote-fileio.o
  CXX    remote-notif.o
  CXX    reverse.o
  CXX    remote.o
  CXX    riscv-fbsd-tdep.o
  CXX    riscv-linux-tdep.o
  CXX    riscv-tdep.o
  CXX    rl78-tdep.o
  CXX    rs6000-aix-tdep.o
  CXX    rs6000-lynx178-tdep.o
  CXX    rs6000-tdep.o
  CXX    rust-exp.o
  CXX    rust-lang.o
  CXX    rx-tdep.o
  CXX    s12z-tdep.o
  CXX    s390-linux-nat.o
  CXX    s390-linux-tdep.o
  CXX    s390-tdep.o
  CXX    score-tdep.o
  CXX    selftest-arch.o
../../binutils-gdb/gdb/s390-linux-nat.c: In member function 'virtual const target_desc* s390_linux_nat_target::read_description()':
../../binutils-gdb/gdb/s390-linux-nat.c:1019:61: error: 'linux_get_hwcap' was not declared in this scope
     CORE_ADDR hwcap = linux_get_hwcap (current_top_target ());
Makefile:1641: recipe for target 's390-linux-nat.o' failed
make[2]: *** [s390-linux-nat.o] Error 1
make[2]: *** Waiting for unfinished jobs....
make[2]: Leaving directory '/home/dje/debian-jessie-s390x-1/debian-s390x-native-extended-gdbserver/build/gdb'
Makefile:8792: recipe for target 'all-gdb' failed
make[1]: Leaving directory '/home/dje/debian-jessie-s390x-1/debian-s390x-native-extended-gdbserver/build'
Makefile:849: recipe for target 'all' failed
make[1]: *** [all-gdb] Error 2
make: *** [all] Error 2

Index Nav: [Date Index] [Subject Index] [Author Index] [Thread Index]
Message Nav: [Date Prev] [Date Next] [Thread Prev] [Thread Next]