This is the mail archive of the gdb-testers@sourceware.org mailing list for the GDB project.


Index Nav: [Date Index] [Subject Index] [Author Index] [Thread Index]
Message Nav: [Date Prev] [Date Next] [Thread Prev] [Thread Next]
Other format: [Raw text]

*** COMPILATION FAILED *** Failures on Ubuntu-Aarch64-native-gdbserver-m64, branch master *** BREAKAGE ***


Buildslave:
	ubuntu16-aarch64

Full Build URL:
	<http://gdb-build.sergiodj.net/builders/Ubuntu-Aarch64-native-gdbserver-m64/builds/4770>

Commit(s) tested:
	053af8c9034f92d6e36a1180655ba22a65c56437

Author(s) (in the same order as the commits):
	Nick Clifton <nickc@redhat.com>

Subject:
	Sync libiberty sources with master version in gcc repository.  Updated stabs demangling and cxxfilt tests to match.

Testsuite log (gdb.sum and gdb.log) URL(s):
	<http://gdb-build.sergiodj.net/results/Ubuntu-Aarch64-native-gdbserver-m64/05/053af8c9034f92d6e36a1180655ba22a65c56437/>

*** Failed to compiled GDB.  ***
============================

+++ The full log is too big to be posted here.
+++ These are the last 100 lines of it.

  CXX    std-regs.o
  CXX    symfile-debug.o
  CXX    symfile-mem.o
  CXX    symfile.o
  CXX    symmisc.o
  CXX    symtab.o
  CXX    target-dcache.o
  CXX    target-descriptions.o
  CXX    target-float.o
  CXX    target-memory.o
  CXX    target.o
  CXX    target/waitstatus.o
  CXX    test-target.o
  CXX    thread-fsm.o
  CXX    thread-iter.o
  CXX    thread.o
  CXX    tic6x-linux-tdep.o
  CXX    tic6x-tdep.o
  CXX    tid-parse.o
  CXX    tilegx-linux-tdep.o
  CXX    tilegx-tdep.o
  CXX    top.o
  CXX    tracefile-tfile.o
  CXX    tracefile.o
  CXX    tracepoint.o
  CXX    trad-frame.o
  CXX    tramp-frame.o
  CXX    typeprint.o
  CXX    ui-file.o
  CXX    ui-out.o
  CXX    ui-style.o
  CXX    unittests/array-view-selftests.o
  CXX    unittests/cli-utils-selftests.o
  CXX    unittests/common-utils-selftests.o
  CXX    unittests/copy_bitwise-selftests.o
  CXX    unittests/environ-selftests.o
  CXX    unittests/format_pieces-selftests.o
  CXX    unittests/function-view-selftests.o
  CXX    unittests/lookup_name_info-selftests.o
  CXX    unittests/memory-map-selftests.o
  CXX    unittests/memrange-selftests.o
  CXX    unittests/mkdir-recursive-selftests.o
  CXX    unittests/observable-selftests.o
  CXX    unittests/offset-type-selftests.o
  CXX    unittests/optional-selftests.o
  CXX    unittests/parse-connection-spec-selftests.o
  CXX    unittests/ptid-selftests.o
  CXX    unittests/rsp-low-selftests.o
  CXX    unittests/scoped_fd-selftests.o
  CXX    unittests/scoped_mmap-selftests.o
  CXX    unittests/scoped_restore-selftests.o
  CXX    unittests/string_view-selftests.o
  CXX    unittests/style-selftests.o
  CXX    unittests/tracepoint-selftests.o
  CXX    unittests/unpack-selftests.o
  CXX    unittests/utils-selftests.o
  CXX    unittests/xml-utils-selftests.o
  CXX    user-regs.o
  CXX    utils.o
  CXX    v850-tdep.o
  CXX    valarith.o
  CXX    valops.o
  CXX    valprint.o
  CXX    value.o
  CXX    varobj.o
  CXX    vax-nbsd-tdep.o
  CXX    vax-tdep.o
  CXX    version.o
  CXX    windows-tdep.o
  CXX    x86-tdep.o
  CXX    xcoffread.o
  CXX    xml-builtin.o
  CXX    xml-support.o
  CXX    xml-syscall.o
  CXX    xml-tdesc.o
  CXX    xstormy16-tdep.o
  CXX    xtensa-config.o
  CXX    xtensa-linux-tdep.o
  CXX    xtensa-tdep.o
  CXX    init.o
  CXXLD  gdb
gdbtypes.o: In function `check_stub_method_group(type*, int)':
/home/gdb_buildbot/ubuntu16-aarch64/ubuntu-aarch64-native-gdbserver-m64/build/gdb/../../binutils-gdb/gdb/gdbtypes.c:2763: undefined reference to `cplus_demangle_opname'
/home/gdb_buildbot/ubuntu16-aarch64/ubuntu-aarch64-native-gdbserver-m64/build/gdb/../../binutils-gdb/gdb/gdbtypes.c:2767: undefined reference to `cplus_demangle_opname'
linespec.o: In function `find_methods(type*, language, char const*, std::__debug::vector<char const*, std::allocator<char const*> >*, std::__debug::vector<type*, std::allocator<type*> >*)':
/home/gdb_buildbot/ubuntu16-aarch64/ubuntu-aarch64-native-gdbserver-m64/build/gdb/../../binutils-gdb/gdb/linespec.c:1260: undefined reference to `cplus_demangle_opname'
/home/gdb_buildbot/ubuntu16-aarch64/ubuntu-aarch64-native-gdbserver-m64/build/gdb/../../binutils-gdb/gdb/linespec.c:1262: undefined reference to `cplus_demangle_opname'
stabsread.o: In function `read_member_functions(field_info*, char const**, type*, objfile*)':
/home/gdb_buildbot/ubuntu16-aarch64/ubuntu-aarch64-native-gdbserver-m64/build/gdb/../../binutils-gdb/gdb/stabsread.c:2713: undefined reference to `cplus_demangle_opname'
stabsread.o:/home/gdb_buildbot/ubuntu16-aarch64/ubuntu-aarch64-native-gdbserver-m64/build/gdb/../../binutils-gdb/gdb/stabsread.c:2716: more undefined references to `cplus_demangle_opname' follow
collect2: error: ld returned 1 exit status
Makefile:1892: recipe for target 'gdb' failed
make[2]: *** [gdb] Error 1
make[2]: Leaving directory '/home/gdb_buildbot/ubuntu16-aarch64/ubuntu-aarch64-native-gdbserver-m64/build/gdb'
Makefile:8792: recipe for target 'all-gdb' failed
make[1]: *** [all-gdb] Error 2
make[1]: Leaving directory '/home/gdb_buildbot/ubuntu16-aarch64/ubuntu-aarch64-native-gdbserver-m64/build'
Makefile:849: recipe for target 'all' failed
make: *** [all] Error 2
============================




Index Nav: [Date Index] [Subject Index] [Author Index] [Thread Index]
Message Nav: [Date Prev] [Date Next] [Thread Prev] [Thread Next]