This is the mail archive of the gdb-testers@sourceware.org mailing list for the GDB project.


Index Nav: [Date Index] [Subject Index] [Author Index] [Thread Index]
Message Nav: [Date Prev] [Date Next] [Thread Prev] [Thread Next]
Other format: [Raw text]

*** COMPILATION FAILED *** Failures on Fedora-x86_64-w64-mingw32, branch master *** BREAKAGE ***


Buildslave:
	fedora-x86-64-3

Full Build URL:
	<http://gdb-build.sergiodj.net/builders/Fedora-x86_64-w64-mingw32/builds/3421>

Commit(s) tested:
	053af8c9034f92d6e36a1180655ba22a65c56437

Author(s) (in the same order as the commits):
	Nick Clifton <nickc@redhat.com>

Subject:
	Sync libiberty sources with master version in gcc repository.  Updated stabs demangling and cxxfilt tests to match.

Testsuite log (gdb.sum and gdb.log) URL(s):
	<http://gdb-build.sergiodj.net/results/Fedora-x86_64-w64-mingw32/05/053af8c9034f92d6e36a1180655ba22a65c56437/>

*** Failed to compiled GDB.  ***
============================

+++ The full log is too big to be posted here.
+++ These are the last 100 lines of it.

  CXX    symfile.o
  CXX    symmisc.o
  CXX    symtab.o
  CXX    target-dcache.o
  CXX    target-descriptions.o
  CXX    target-float.o
  CXX    target-memory.o
  CXX    target.o
  CXX    target/waitstatus.o
  CXX    test-target.o
  CXX    thread-fsm.o
  CXX    thread-iter.o
  CXX    thread.o
  CXX    tic6x-linux-tdep.o
  CXX    tic6x-tdep.o
  CXX    tid-parse.o
  CXX    tilegx-linux-tdep.o
  CXX    tilegx-tdep.o
  CXX    top.o
  CXX    tracefile-tfile.o
  CXX    tracefile.o
  CXX    tracepoint.o
  CXX    trad-frame.o
  CXX    tramp-frame.o
  CXX    typeprint.o
  CXX    ui-file.o
  CXX    ui-out.o
  CXX    ui-style.o
  CXX    unittests/array-view-selftests.o
  CXX    unittests/cli-utils-selftests.o
  CXX    unittests/common-utils-selftests.o
  CXX    unittests/copy_bitwise-selftests.o
  CXX    unittests/environ-selftests.o
  CXX    unittests/format_pieces-selftests.o
  CXX    unittests/function-view-selftests.o
  CXX    unittests/lookup_name_info-selftests.o
  CXX    unittests/memory-map-selftests.o
  CXX    unittests/memrange-selftests.o
  CXX    unittests/mkdir-recursive-selftests.o
  CXX    unittests/observable-selftests.o
  CXX    unittests/offset-type-selftests.o
  CXX    unittests/optional-selftests.o
  CXX    unittests/parse-connection-spec-selftests.o
  CXX    unittests/ptid-selftests.o
  CXX    unittests/rsp-low-selftests.o
  CXX    unittests/scoped_fd-selftests.o
  CXX    unittests/scoped_mmap-selftests.o
  CXX    unittests/scoped_restore-selftests.o
  CXX    unittests/string_view-selftests.o
  CXX    unittests/style-selftests.o
  CXX    unittests/tracepoint-selftests.o
  CXX    unittests/unpack-selftests.o
  CXX    unittests/utils-selftests.o
  CXX    unittests/xml-utils-selftests.o
  CXX    user-regs.o
  CXX    utils.o
  CXX    v850-tdep.o
  CXX    valarith.o
  CXX    valops.o
  CXX    valprint.o
  CXX    value.o
  CXX    varobj.o
  CXX    vax-nbsd-tdep.o
  CXX    vax-tdep.o
  CXX    version.o
  CXX    windows-nat.o
  CXX    windows-tdep.o
  CXX    x86-nat.o
  CXX    x86-tdep.o
  CXX    xcoffread.o
  CXX    xml-builtin.o
  CXX    xml-support.o
  CXX    xml-syscall.o
../../binutils-gdb/gdb/windows-nat.c: In member function 'virtual void windows_nat_target::create_inferior(const char*, const string&, char**, int)':
../../binutils-gdb/gdb/windows-nat.c:2804:26: warning: 'shell[0]' may be used uninitialized in this function [-Wmaybe-uninitialized]
   if (useshell && shell[0] != '\0')
                   ~~~~~~~^
  CXX    xml-tdesc.o
  CXX    xstormy16-tdep.o
  CXX    xtensa-config.o
  CXX    xtensa-linux-tdep.o
  CXX    xtensa-tdep.o
  CXX    init.o
  CXXLD  gdb.exe
gdbtypes.o: In function `check_stub_method_group(type*, int)':
/home/gdb-buildbot/fedora-x86-64-3/fedora-x86-64-mingw32/build/gdb/../../binutils-gdb/gdb/gdbtypes.c:2761: undefined reference to `cplus_demangle_opname'
/home/gdb-buildbot/fedora-x86-64-3/fedora-x86-64-mingw32/build/gdb/../../binutils-gdb/gdb/gdbtypes.c:2765: undefined reference to `cplus_demangle_opname'
linespec.o: In function `find_methods':
/home/gdb-buildbot/fedora-x86-64-3/fedora-x86-64-mingw32/build/gdb/../../binutils-gdb/gdb/linespec.c:1260: undefined reference to `cplus_demangle_opname'
/home/gdb-buildbot/fedora-x86-64-3/fedora-x86-64-mingw32/build/gdb/../../binutils-gdb/gdb/linespec.c:1262: undefined reference to `cplus_demangle_opname'
stabsread.o: In function `read_member_functions':
/home/gdb-buildbot/fedora-x86-64-3/fedora-x86-64-mingw32/build/gdb/../../binutils-gdb/gdb/stabsread.c:2712: undefined reference to `cplus_demangle_opname'
stabsread.o:/home/gdb-buildbot/fedora-x86-64-3/fedora-x86-64-mingw32/build/gdb/../../binutils-gdb/gdb/stabsread.c:2715: more undefined references to `cplus_demangle_opname' follow
collect2: error: ld returned 1 exit status
make[2]: *** [Makefile:1889: gdb.exe] Error 1
make[2]: Leaving directory '/home/gdb-buildbot/fedora-x86-64-3/fedora-x86-64-mingw32/build/gdb'
make[1]: *** [Makefile:8480: all-gdb] Error 2
make[1]: Leaving directory '/home/gdb-buildbot/fedora-x86-64-3/fedora-x86-64-mingw32/build'
make: *** [Makefile:857: all] Error 2
============================




Index Nav: [Date Index] [Subject Index] [Author Index] [Thread Index]
Message Nav: [Date Prev] [Date Next] [Thread Prev] [Thread Next]