This is the mail archive of the gdb-testers@sourceware.org mailing list for the GDB project.


Index Nav: [Date Index] [Subject Index] [Author Index] [Thread Index]
Message Nav: [Date Prev] [Date Next] [Thread Prev] [Thread Next]
Other format: [Raw text]

*** COMPILATION FAILED *** Failures on Fedora-x86_64-m64, branch master *** BREAKAGE ***


Buildslave:
	fedora-x86-64-4

Full Build URL:
	<http://gdb-build.sergiodj.net/builders/Fedora-x86_64-m64/builds/11851>

Commit(s) tested:
	053af8c9034f92d6e36a1180655ba22a65c56437

Author(s) (in the same order as the commits):
	Nick Clifton <nickc@redhat.com>

Subject:
	Sync libiberty sources with master version in gcc repository.  Updated stabs demangling and cxxfilt tests to match.

Testsuite log (gdb.sum and gdb.log) URL(s):
	<http://gdb-build.sergiodj.net/results/Fedora-x86_64-m64/05/053af8c9034f92d6e36a1180655ba22a65c56437/>

*** Failed to compiled GDB.  ***
============================

+++ The full log is too big to be posted here.
+++ These are the last 100 lines of it.

  CXX    tic6x-linux-tdep.o
  CXX    tic6x-tdep.o
  CXX    tid-parse.o
  CXX    tilegx-linux-tdep.o
  CXX    tilegx-tdep.o
  CXX    top.o
  CXX    tracefile-tfile.o
  CXX    tracefile.o
  CXX    tracepoint.o
  CXX    trad-frame.o
  CXX    tramp-frame.o
  CXX    tui/tui-command.o
  CXX    tui/tui-data.o
  CXX    tui/tui-disasm.o
  CXX    tui/tui-file.o
  CXX    tui/tui-hooks.o
  CXX    tui/tui-interp.o
  CXX    tui/tui-io.o
  CXX    tui/tui-layout.o
  CXX    tui/tui-out.o
  CXX    tui/tui-regs.o
  CXX    tui/tui-source.o
  CXX    tui/tui-stack.o
  CXX    tui/tui-win.o
  CXX    tui/tui-windata.o
  CXX    tui/tui-wingeneral.o
  CXX    tui/tui-winsource.o
  CXX    tui/tui.o
  CXX    typeprint.o
  CXX    ui-file.o
  CXX    ui-out.o
  CXX    ui-style.o
  CXX    unittests/array-view-selftests.o
  CXX    unittests/cli-utils-selftests.o
  CXX    unittests/common-utils-selftests.o
  CXX    unittests/copy_bitwise-selftests.o
  CXX    unittests/environ-selftests.o
  CXX    unittests/format_pieces-selftests.o
  CXX    unittests/function-view-selftests.o
  CXX    unittests/lookup_name_info-selftests.o
  CXX    unittests/memory-map-selftests.o
  CXX    unittests/memrange-selftests.o
  CXX    unittests/mkdir-recursive-selftests.o
  CXX    unittests/observable-selftests.o
  CXX    unittests/offset-type-selftests.o
  CXX    unittests/optional-selftests.o
  CXX    unittests/parse-connection-spec-selftests.o
  CXX    unittests/ptid-selftests.o
  CXX    unittests/rsp-low-selftests.o
  CXX    unittests/scoped_fd-selftests.o
  CXX    unittests/scoped_mmap-selftests.o
  CXX    unittests/scoped_restore-selftests.o
  CXX    unittests/string_view-selftests.o
  CXX    unittests/style-selftests.o
  CXX    unittests/tracepoint-selftests.o
  CXX    unittests/unpack-selftests.o
  CXX    unittests/utils-selftests.o
  CXX    unittests/xml-utils-selftests.o
  CXX    user-regs.o
  CXX    utils.o
  CXX    v850-tdep.o
  CXX    valarith.o
  CXX    valops.o
  CXX    valprint.o
  CXX    value.o
  CXX    varobj.o
  CXX    vax-nbsd-tdep.o
  CXX    vax-tdep.o
  CXX    version.o
  CXX    windows-tdep.o
  CXX    x86-linux-nat.o
  CXX    x86-nat.o
  CXX    x86-tdep.o
  CXX    xcoffread.o
  CXX    xml-builtin.o
  CXX    xml-support.o
  CXX    xml-syscall.o
  CXX    xml-tdesc.o
  CXX    xstormy16-tdep.o
  CXX    xtensa-config.o
  CXX    xtensa-linux-tdep.o
  CXX    xtensa-tdep.o
  CXX    init.o
  CXXLD  gdb
/usr/bin/ld: gdbtypes.o: in function `check_stub_method_group(type*, int)':
/home/gdb-buildbot-2/fedora-x86-64-4/fedora-x86-64/build/gdb/../../binutils-gdb/gdb/gdbtypes.c:2761: undefined reference to `cplus_demangle_opname'
/usr/bin/ld: /home/gdb-buildbot-2/fedora-x86-64-4/fedora-x86-64/build/gdb/../../binutils-gdb/gdb/gdbtypes.c:2765: undefined reference to `cplus_demangle_opname'
/usr/bin/ld: linespec.o: in function `find_methods(type*, language, char const*, std::__debug::vector<char const*, std::allocator<char const*> >*, std::__debug::vector<type*, std::allocator<type*> >*)':
/home/gdb-buildbot-2/fedora-x86-64-4/fedora-x86-64/build/gdb/../../binutils-gdb/gdb/linespec.c:1260: undefined reference to `cplus_demangle_opname'
/usr/bin/ld: /home/gdb-buildbot-2/fedora-x86-64-4/fedora-x86-64/build/gdb/../../binutils-gdb/gdb/linespec.c:1262: undefined reference to `cplus_demangle_opname'
/usr/bin/ld: stabsread.o: in function `read_member_functions(field_info*, char const**, type*, objfile*)':
/home/gdb-buildbot-2/fedora-x86-64-4/fedora-x86-64/build/gdb/../../binutils-gdb/gdb/stabsread.c:2712: undefined reference to `cplus_demangle_opname'
/usr/bin/ld: stabsread.o:/home/gdb-buildbot-2/fedora-x86-64-4/fedora-x86-64/build/gdb/../../binutils-gdb/gdb/stabsread.c:2715: more undefined references to `cplus_demangle_opname' follow
collect2: error: ld returned 1 exit status
make[2]: *** [Makefile:1893: gdb] Error 1
make[2]: Leaving directory '/home/gdb-buildbot-2/fedora-x86-64-4/fedora-x86-64/build/gdb'
make[1]: *** [Makefile:8793: all-gdb] Error 2
make[1]: Leaving directory '/home/gdb-buildbot-2/fedora-x86-64-4/fedora-x86-64/build'
make: *** [Makefile:850: all] Error 2
============================




Index Nav: [Date Index] [Subject Index] [Author Index] [Thread Index]
Message Nav: [Date Prev] [Date Next] [Thread Prev] [Thread Next]