This is the mail archive of the mailing list for the GDB project.

Index Nav: [Date Index] [Subject Index] [Author Index] [Thread Index]
Message Nav: [Date Prev] [Date Next] [Thread Prev] [Thread Next]
Other format: [Raw text]

*** COMPILATION FAILED *** Failures on Solaris11-amd64-m64, branch master *** BREAKAGE ***


Full Build URL:

Commit(s) tested:

Author(s) (in the same order as the commits):
	Nick Clifton <>

	Sync libiberty sources with master version in gcc repository.  Updated stabs demangling and cxxfilt tests to match.

Testsuite log (gdb.sum and gdb.log) URL(s):

*** Failed to compiled GDB.  ***

+++ The full log is too big to be posted here.
+++ These are the last 100 lines of it.

   scoped_switch_to_sym_language_if_auto l (sym);
In file included from ../../binutils-gdb/gdb/frame.h:72:0,
                 from ../../binutils-gdb/gdb/gdbarch.h:39,
                 from ../../binutils-gdb/gdb/defs.h:526,
                 from ../../binutils-gdb/gdb/symtab.c:20:
../../binutils-gdb/gdb/language.h: In function bool treg_matches_sym_type_name(const compiled_regex&, const symbol*):
../../binutils-gdb/gdb/language.h:735:20: warning: *((void*)& l +4) may be used uninitialized in this function [-Wmaybe-uninitialized]
       set_language (m_lang);
../../binutils-gdb/gdb/symtab.c:4292:43: note: *((void*)& l +4) was declared here
     scoped_switch_to_sym_language_if_auto l (sym);
  CXX    target-memory.o
  CXX    target.o
  CXX    target/waitstatus.o
  CXX    test-target.o
  CXX    thread-fsm.o
  CXX    thread-iter.o
  CXX    thread.o
  CXX    tid-parse.o
  CXX    top.o
  CXX    tracefile-tfile.o
  CXX    tracefile.o
  CXX    tracepoint.o
  CXX    trad-frame.o
  CXX    tramp-frame.o
  CXX    tui/tui-command.o
  CXX    tui/tui-data.o
  CXX    tui/tui-disasm.o
  CXX    tui/tui-file.o
  CXX    tui/tui-hooks.o
  CXX    tui/tui-interp.o
  CXX    tui/tui-io.o
  CXX    tui/tui-layout.o
  CXX    tui/tui-out.o
  CXX    tui/tui-regs.o
  CXX    tui/tui-source.o
  CXX    tui/tui-stack.o
  CXX    tui/tui-win.o
  CXX    tui/tui-windata.o
  CXX    tui/tui-wingeneral.o
  CXX    tui/tui-winsource.o
  CXX    tui/tui.o
  CXX    typeprint.o
  CXX    ui-file.o
  CXX    ui-out.o
  CXX    ui-style.o
  CXX    unittests/array-view-selftests.o
  CXX    unittests/cli-utils-selftests.o
  CXX    unittests/common-utils-selftests.o
  CXX    unittests/copy_bitwise-selftests.o
  CXX    unittests/environ-selftests.o
  CXX    unittests/format_pieces-selftests.o
  CXX    unittests/function-view-selftests.o
  CXX    unittests/lookup_name_info-selftests.o
  CXX    unittests/memory-map-selftests.o
  CXX    unittests/memrange-selftests.o
  CXX    unittests/mkdir-recursive-selftests.o
  CXX    unittests/observable-selftests.o
  CXX    unittests/offset-type-selftests.o
  CXX    unittests/optional-selftests.o
  CXX    unittests/parse-connection-spec-selftests.o
  CXX    unittests/ptid-selftests.o
  CXX    unittests/rsp-low-selftests.o
  CXX    unittests/scoped_fd-selftests.o
  CXX    unittests/scoped_mmap-selftests.o
  CXX    unittests/scoped_restore-selftests.o
  CXX    unittests/string_view-selftests.o
  CXX    unittests/style-selftests.o
  CXX    unittests/tracepoint-selftests.o
  CXX    unittests/unpack-selftests.o
  CXX    unittests/utils-selftests.o
  CXX    unittests/xml-utils-selftests.o
  CXX    user-regs.o
  CXX    utils.o
  CXX    valarith.o
  CXX    valops.o
  CXX    valprint.o
  CXX    value.o
  CXX    varobj.o
  CXX    version.o
  CXX    x86-tdep.o
  CXX    xml-builtin.o
  CXX    xml-support.o
  CXX    xml-syscall.o
  CXX    xml-tdesc.o
  CXX    init.o
  CXXLD  gdb
Undefined			first referenced
 symbol  			    in file
cplus_demangle_opname               gdbtypes.o
ld: fatal: symbol referencing errors
collect2: error: ld returned 1 exit status
gmake[2]: *** [Makefile:1891: gdb] Error 1
gmake[2]: Leaving directory '/opt/gdb-buildbot/home/solaris11-amd64/solaris11-amd64-m64/build/gdb'
gmake[1]: *** [Makefile:8792: all-gdb] Error 2
gmake[1]: Leaving directory '/opt/gdb-buildbot/home/solaris11-amd64/solaris11-amd64-m64/build'
gmake: *** [Makefile:849: all] Error 2

Index Nav: [Date Index] [Subject Index] [Author Index] [Thread Index]
Message Nav: [Date Prev] [Date Next] [Thread Prev] [Thread Next]