gdb-prs archive
date index for July - September, 2016

This is the mail archive of the gdb-prs@sourceware.org mailing list for the GDB project.

Indexes: [Date Index] [Subject Index] [Author Index] [Thread Index]
Site Nav: [Browse other archives for this mailing list]
[Browse other mailing lists at this site]
Search: Limit to:


2016-08-24 [Bug breakpoints/11094] cannot reexecute programs using the GDB JIT interface in shared libs palves at redhat dot com
2016-08-24 [Bug breakpoints/11094] cannot reexecute programs using the GDB JIT interface in shared libs palves at redhat dot com
2016-08-24 [Bug breakpoints/11094] cannot reexecute programs using the GDB JIT interface in shared libs palves at redhat dot com
2016-08-24 [Bug breakpoints/11094] cannot reexecute programs using the GDB JIT interface in shared libs palves at redhat dot com
2016-08-24 [Bug backtrace/9430] wrong back trace on x86_64 when pthread_mutex_lock is the innermost function call. bit mode/kernel version/compiler version are irrelevant kiransstechnologies at gmail dot com
2016-08-24 [Bug breakpoints/11094] cannot reexecute programs using the GDB JIT interface in shared libs laruence at gmail dot com
2016-08-24 [Bug gdb/20415] GDB does not compile on x32 native system walfred.tedeschi at intel dot com
2016-08-23 [Bug gdb/20415] GDB does not compile on x32 native system palves at redhat dot com
2016-08-23 [Bug gdb/20415] GDB does not compile on x32 native system cvs-commit at gcc dot gnu.org
2016-08-23 [Bug python/19286] crash when requesting "pc" from pending frame object palves at redhat dot com
2016-08-23 [Bug backtrace/19927] Python unwinder API should be resilient to recursion and frame cache reinitialization palves at redhat dot com
2016-08-23 [Bug backtrace/19927] Python unwinder API should be resilient to recursion and frame cache reinitialization palves at redhat dot com
2016-08-23 [Bug python/20509] New: provide a way to evaluate an expression in a certain language tromey at sourceware dot org
2016-08-23 [Bug varobj/20506] floating point register not print in 'f' format will get the wrong value schwab at linux-m68k dot org
2016-08-23 [Bug gdb/20494] User input stops being echoed in CLI palves at redhat dot com
2016-08-23 [Bug gdb/20494] User input stops being echoed in CLI cvs-commit at gcc dot gnu.org
2016-08-23 [Bug gdb/20494] User input stops being echoed in CLI cvs-commit at gcc dot gnu.org
2016-08-23 [Bug varobj/20506] floating point register not print in 'f' format will get the wrong value elson.wei at gmail dot com
2016-08-23 [Bug gdb/20506] floating point register not print in 'f' format will get the wrong value elson.wei at gmail dot com
2016-08-23 [Bug gdb/20506] New: floating point register not print in 'f' format will get the wrong value elson.wei at gmail dot com
2016-08-22 [Bug gdb/20494] User input stops being echoed in CLI simon.marchi at ericsson dot com
2016-08-22 [Bug symtab/14466] unable to load symbols for linux-gate.so.1 (vdso) palves at redhat dot com
2016-08-22 [Bug gdb/20505] warning: Could not load shared library symbols for linux-vdso.so.1 (debugging core file) palves at redhat dot com
2016-08-22 [Bug gdb/20505] warning: Could not load shared library symbols for linux-vdso.so.1 (debugging core file) cvs-commit at gcc dot gnu.org
2016-08-22 [Bug gdb/20505] warning: Could not load shared library symbols for linux-vdso.so.1 (debugging core file) cvs-commit at gcc dot gnu.org
2016-08-22 [Bug gdb/20505] warning: Could not load shared library symbols for linux-vdso.so.1 (debugging core file) palves at redhat dot com
2016-08-22 [Bug gdb/20505] New: warning: Could not load shared library symbols for linux-vdso.so.1 (debugging core file) palves at redhat dot com
2016-08-22 [Bug gdb/20494] User input stops being echoed in CLI palves at redhat dot com
2016-08-22 [Bug objc/20503] New: ObjC runtime debugging support is severely broken gdb at crelg dot com
2016-08-22 [Bug gdb/20494] User input stops being echoed in CLI palves at redhat dot com
2016-08-22 [Bug gdb/20494] User input stops being echoed in CLI marc.khouzam at ericsson dot com
2016-08-22 [Bug gdb/20494] User input stops being echoed in CLI marc.khouzam at ericsson dot com
2016-08-22 [Bug gdb/20494] User input stops being echoed in CLI palves at redhat dot com
2016-08-22 [Bug gdb/20494] User input stops being echoed in CLI palves at redhat dot com
2016-08-22 [Bug gdb/20494] User input stops being echoed in CLI palves at redhat dot com
2016-08-22 [Bug objc/20501] Creating NSString convenience variable crashes GDB gdb at crelg dot com
2016-08-22 [Bug objc/20501] Creating NSString convenience variable crashes GDB gdb at crelg dot com
2016-08-22 [Bug objc/20501] Creating NSString convenience variable crashes GDB gdb at crelg dot com
2016-08-22 [Bug objc/20501] Creating NSString convenience variable crashes GDB gdb at crelg dot com
2016-08-22 [Bug objc/20501] New: Creating NSString convenience variable crashes GDB gdb at crelg dot com
2016-08-22 [Bug gdb/11616] DW_OP_form_tls_address is unimplemented tromey at sourceware dot org
2016-08-22 [Bug gdb/11616] DW_OP_form_tls_address is unimplemented tromey at sourceware dot org
2016-08-19 [Bug gdb/20494] User input stops being echoed in CLI marc.khouzam at ericsson dot com
2016-08-19 [Bug gdb/20494] New: User input stops being echoed in CLI marc.khouzam at ericsson dot com
2016-08-19 [Bug gdb/20487] Thread sync broken between mi and cli with new-ui command simon.marchi at ericsson dot com
2016-08-19 [Bug gdb/20415] GDB does not compile on x32 native system cvs-commit at gcc dot gnu.org
2016-08-19 [Bug gdb/20415] GDB does not compile on x32 native system palves at redhat dot com
2016-08-19 [Bug server/20491] Failed to build GDBserver with --disable-build-with-cxx qiyao at gcc dot gnu.org
2016-08-19 [Bug server/20491] New: Failed to build GDBserver with --disable-build-with-cxx qiyao at gcc dot gnu.org
2016-08-18 [Bug gdb/20487] Thread sync broken between mi and cli with new-ui command antoine.tremblay at ericsson dot com
2016-08-18 [Bug gdb/20487] Thread sync broken between mi and cli with new-ui command palves at redhat dot com
2016-08-18 [Bug gdb/20487] Thread sync broken between mi and cli with new-ui command antoine.tremblay at ericsson dot com
2016-08-18 [Bug gdb/20487] Thread sync broken between mi and cli with new-ui command antoine.tremblay at ericsson dot com
2016-08-18 [Bug gdb/20487] Thread sync broken between mi and cli with new-ui command palves at redhat dot com
2016-08-18 [Bug gdb/20487] Thread sync broken between mi and cli with new-ui command palves at redhat dot com
2016-08-18 [Bug gdb/20487] Thread sync broken between mi and cli with new-ui command antoine.tremblay at ericsson dot com
2016-08-18 [Bug gdb/20487] Thread sync broken between mi and cli with new-ui command antoine.tremblay at ericsson dot com
2016-08-18 [Bug breakpoints/19598] GDB breakpoint locks up Ubuntu UI, requiring reboot drn at nadler dot com
2016-08-18 [Bug gdb/20487] Thread sync broken between mi and cli with new-ui command palves at redhat dot com
2016-08-18 [Bug gdb/20487] Thread sync broken between mi and cli with new-ui command marc.khouzam at ericsson dot com
2016-08-18 [Bug gdb/20487] Thread sync broken between mi and cli with new-ui command antoine.tremblay at ericsson dot com
2016-08-18 [Bug gdb/20487] Thread sync broken between mi and cli with new-ui command antoine.tremblay at ericsson dot com
2016-08-18 [Bug gdb/20487] Thread sync broken between mi and cli with new-ui command antoine.tremblay at ericsson dot com
2016-08-18 [Bug gdb/20487] Thread sync broken between mi and cli with new-ui command antoine.tremblay at ericsson dot com
2016-08-18 [Bug gdb/20487] New: Thread sync broken between mi and cli with new-ui command antoine.tremblay at ericsson dot com
2016-08-18 [Bug gdb/20176] gdbserver follow-fork internal-error (suspended=-1) vinay.g at kpit dot com
2016-08-17 [Bug gdb/20485] sigprocmask in tracee affects tracer as well palves at redhat dot com
2016-08-17 [Bug gdb/20485] New: sigprocmask in tracee affects tracer as well jengelh at inai dot de
2016-08-16 [Bug build/20457] gdb build can fail to build with new glibc qiyao at gcc dot gnu.org
2016-08-15 [Bug build/20457] gdb build can fail to build with new glibc cvs-commit at gcc dot gnu.org
2016-08-15 [Bug build/20470] Python extension fails to build on AIX dje at gcc dot gnu.org
2016-08-15 [Bug build/20470] New: Python extension fails to build on AIX dje at gcc dot gnu.org
2016-08-15 [Bug build/20457] gdb build can fail to build with new glibc cvs-commit at gcc dot gnu.org
2016-08-14 [Bug record/20456] gdb crash with record and d dimhen at gmail dot com
2016-08-13 [Bug sim/20438] GDB Simulator build failure on Blackfin with older gcc: common/sim-base.h:76: error: redefinition of typedef 'SIM_CPU' vapier at gentoo dot org
2016-08-13 [Bug sim/20438] GDB Simulator build failure on Blackfin with older gcc: common/sim-base.h:76: error: redefinition of typedef 'SIM_CPU' cvs-commit at gcc dot gnu.org
2016-08-13 [Bug sim/20438] GDB Simulator build failure on Blackfin with older gcc: common/sim-base.h:76: error: redefinition of typedef 'SIM_CPU' cvs-commit at gcc dot gnu.org
2016-08-13 [Bug python/20077] gdb.Value string object has strlen of 1 after backtrace kieranbingham at gmail dot com
2016-08-12 [Bug build/20457] gdb build can fail to build with new glibc qiyao at gcc dot gnu.org
2016-08-12 [Bug c++/19436] C++11 ABI tag does not work qiyao at gcc dot gnu.org
2016-08-11 [Bug record/20456] gdb crash with record and d 13nixonf at gmail dot com
2016-08-11 [Bug record/20456] gdb crash with record and d 13nixonf at gmail dot com
2016-08-11 [Bug gdb/20413] x32: linux_ptrace_test_ret_to_nx: Cannot PTRACE_PEEKUSER palves at redhat dot com
2016-08-11 [Bug gdb/20413] x32: linux_ptrace_test_ret_to_nx: Cannot PTRACE_PEEKUSER cvs-commit at gcc dot gnu.org
2016-08-11 [Bug build/20457] gdb build can fail to build with new glibc mwahab at gcc dot gnu.org
2016-08-11 [Bug build/20457] New: gdb build can fail to build with new glibc mwahab at gcc dot gnu.org
2016-08-11 [Bug gdb/20413] x32: linux_ptrace_test_ret_to_nx: Cannot PTRACE_PEEKUSER cvs-commit at gcc dot gnu.org
2016-08-11 [Bug gdb/20413] x32: linux_ptrace_test_ret_to_nx: Cannot PTRACE_PEEKUSER equationssolver at yahoo dot com
2016-08-11 [Bug record/20456] gdb crash with record and d palves at redhat dot com
2016-08-11 [Bug gdb/20413] x32: linux_ptrace_test_ret_to_nx: Cannot PTRACE_PEEKUSER palves at redhat dot com
2016-08-11 [Bug gdb/20413] x32: linux_ptrace_test_ret_to_nx: Cannot PTRACE_PEEKUSER equationssolver at yahoo dot com
2016-08-11 [Bug sim/20451] sim: ppc: integer constant is too large warnings vapier at gentoo dot org
2016-08-11 [Bug record/20456] gdb crash with record and d 13nixonf at gmail dot com
2016-08-10 [Bug record/20456] gdb crash with record and d 13nixonf at gmail dot com
2016-08-10 [Bug breakpoints/20345] call_function_by_hand_dummy: Assertion `tp->thread_fsm == &sm->thread_fsm' failed palves at redhat dot com
2016-08-10 [Bug sim/20451] integer constant is too large warnings when compiling ppc sim palves at redhat dot com
2016-08-10 [Bug sim/20451] integer constant is too large errors when compiling ppc sim palves at redhat dot com
2016-08-10 [Bug sim/20451] integer constant is too large errors when compiling gdb palves at redhat dot com
2016-08-10 [Bug c++/19730] GDB crashing before starting the debug session palves at redhat dot com
2016-08-10 [Bug record/20456] gdb crash with record and d palves at redhat dot com
2016-08-10 [Bug gdb/17511] Program received signal SIGTRAP, after step to signal handler -> step inside handler -> continue palves at redhat dot com
2016-08-10 [Bug record/19187] running with process record over a fork causes GDB internal error palves at redhat dot com
2016-08-10 [Bug record/19187] running with process record over a fork causes GDB internal error cvs-commit at gcc dot gnu.org
2016-08-10 [Bug record/19187] running with process record over a fork causes GDB internal error cvs-commit at gcc dot gnu.org
2016-08-10 [Bug record/19187] running with process record over a fork causes GDB internal error cvs-commit at gcc dot gnu.org
2016-08-10 [Bug record/19187] running with process record over a fork causes GDB internal error cvs-commit at gcc dot gnu.org
2016-08-10 [Bug record/19187] running with process record over a fork causes GDB internal error cvs-commit at gcc dot gnu.org
2016-08-10 [Bug record/19187] running with process record over a fork causes GDB internal error cvs-commit at gcc dot gnu.org
2016-08-10 [Bug record/19187] running with process record over a fork causes GDB internal error cvs-commit at gcc dot gnu.org
2016-08-10 [Bug record/19187] running with process record over a fork causes GDB internal error cvs-commit at gcc dot gnu.org
2016-08-10 [Bug record/20456] New: gdb crash with record and d 13nixonf at gmail dot com
2016-08-09 [Bug gdb/20418] Problems with synchronous commands and new-ui palves at redhat dot com
2016-08-09 [Bug mi/20431] Missing MI prompts after sync execution MI command (-exec-continue, etc.) errors palves at redhat dot com
2016-08-09 [Bug gdb/20418] Problems with synchronous commands and new-ui cvs-commit at gcc dot gnu.org
2016-08-09 [Bug mi/20431] Missing MI prompts after sync execution MI command (-exec-continue, etc.) errors cvs-commit at gcc dot gnu.org
2016-08-09 [Bug gdb/20418] Problems with synchronous commands and new-ui cvs-commit at gcc dot gnu.org
2016-08-09 [Bug mi/20431] Missing MI prompts after sync execution MI command (-exec-continue, etc.) errors cvs-commit at gcc dot gnu.org
2016-08-09 [Bug breakpoints/17431] follow-exec, "always-inserted on", breakpoints inserted too soon palves at redhat dot com
2016-08-09 [Bug gdb/19061] gdb-7.10 hangs/spins-on-cpu when debugging any program on Alpha palves at redhat dot com
2016-08-09 [Bug gdb/15871] Unavailable entry value is not shown correctly palves at redhat dot com
2016-08-09 [Bug tui/9765] Scrolling to end of program in asm layout is broken palves at redhat dot com
2016-08-09 [Bug gdb/17472] with annotations, input while executing in the foreground crashes readline/gdb palves at redhat dot com
2016-08-09 [Bug gdb/18653] spawn changes SIGPIPE SIG_DFL to SIG_IGN palves at redhat dot com
2016-08-09 [Bug gdb/18653] spawn changes SIGPIPE SIG_DFL to SIG_IGN cvs-commit at gcc dot gnu.org
2016-08-09 [Bug gdb/18653] spawn changes SIGPIPE SIG_DFL to SIG_IGN cvs-commit at gcc dot gnu.org
2016-08-09 [Bug c++/19330] demangler failed with signal 11 markus at trippelsdorf dot de
2016-08-09 [Bug c++/19330] demangler failed with signal 11 tgrabiec at gmail dot com
2016-08-09 [Bug breakpoints/20208] Error re-setting pending dprintf when re-running simon.marchi at ericsson dot com
2016-08-09 [Bug c++/19330] demangler failed with signal 11 markus at trippelsdorf dot de
2016-08-09 [Bug c++/19330] demangler failed with signal 11 tgrabiec at gmail dot com
2016-08-09 [Bug c++/19330] demangler failed with signal 11 markus at trippelsdorf dot de
2016-08-09 [Bug c++/19190] Demangler crash palves at redhat dot com
2016-08-09 [Bug c++/19330] demangler failed with signal 11 palves at redhat dot com
2016-08-09 [Bug c++/17656] segmentation fault while loading symbols palves at redhat dot com
2016-08-09 [Bug gdb/17708] GDB segfault when demangling symbol palves at redhat dot com
2016-08-09 [Bug c++/18129] Segfault when reading symbols palves at redhat dot com
2016-08-09 [Bug c++/18697] Demangler crash palves at redhat dot com
2016-08-09 [Bug c++/18697] Demangler crash palves at redhat dot com
2016-08-09 [Bug gdb/18805] GDB crashes on loading symbols (init class with tuple) palves at redhat dot com
2016-08-09 [Bug gdb/18805] GDB crashes on loading symbols (init class with tuple) palves at redhat dot com
2016-08-09 [Bug gdb/18807] GDB crashes on make_tuple( [](auto&& x){} ) palves at redhat dot com
2016-08-09 [Bug compile/20451] integer constant is too large errors when compiling gdb braunster at gmail dot com
2016-08-09 [Bug compile/20451] New: integer constant is too large errors when compiling gdb braunster at gmail dot com
2016-08-09 [Bug c++/19597] Buffer Overflow during Demangling palves at redhat dot com
2016-08-09 [Bug c++/19597] Buffer Overflow during Demangling palves at redhat dot com
2016-08-09 [Bug gdb/20295] GDB segfaults printing bitfield member of optimized out value palves at redhat dot com
2016-08-09 [Bug gdb/20295] GDB segfaults printing bitfield member of optimized out value cvs-commit at gcc dot gnu.org
2016-08-09 [Bug gdb/20295] GDB segfaults printing bitfield member of optimized out value cvs-commit at gcc dot gnu.org
2016-08-09 [Bug gdb/20295] GDB segfaults printing bitfield member of optimized out value palves at redhat dot com
2016-08-09 [Bug gdb/20295] GDB segfaults printing structure member palves at redhat dot com
2016-08-09 [Bug python/19911] gdb.execute ("interpreter-exec mi \"-gdb-show width\"", to_string = True) with -i=mi2 crashes gdb catalin.udma at freescale dot com
2016-08-09 [Bug build/20407] ***SPAM*** Summary removed. carlos at redhat dot com
2016-08-09 [Bug build/20409] ***SPAM*** Summary removed. carlos at redhat dot com
2016-08-09 [Bug build/20407] ***SPAM*** Summary removed. carlos at redhat dot com
2016-08-09 [Bug build/20409] ***SPAM*** Summary removed. carlos at redhat dot com
2016-08-09 [Bug c++/19597] Buffer Overflow during Demangling boehme.marcel at gmail dot com
2016-08-09 [Bug c++/20399] casts.cc test case fails to compile palves at redhat dot com
2016-08-09 [Bug gdb/20368] gdb embedded in NXP LPCXpresso Eclipse based IDE palves at redhat dot com
2016-08-09 [Bug gdb/20295] GDB segfaults printing structure member palves at redhat dot com
2016-08-08 [Bug gdb/20269] Internal error in elf_x86_64_get_plt_sym_val palves at redhat dot com
2016-08-08 [Bug breakpoints/20208] Error re-setting pending dprintf when re-running palves at redhat dot com
2016-08-08 [Bug c++/20185] RTTI symbol not found for nested virtual class palves at redhat dot com
2016-08-08 [Bug gdb/17607] With some locales, entering a valid floating point number gives "Invalid number" palves at redhat dot com
2016-08-08 [Bug gdb/17607] With some locales, entering a valid floating point number gives "Invalid number" palves at redhat dot com
2016-08-08 [Bug gdb/20449] New: Test printing/parsing floating points with locale uses comma as decimal separator palves at redhat dot com
2016-08-08 [Bug gdb/17607] With some locales, entering a valid floating point number gives "Invalid number" palves at redhat dot com
2016-08-08 [Bug gdb/20007] 'section' command doesn't work ariscop at gmail dot com
2016-08-08 [Bug gdb/20176] gdbserver follow-fork internal-error (suspended=-1) palves at redhat dot com
2016-08-08 [Bug python/20077] gdb.Value string object has strlen of 1 after backtrace palves at redhat dot com
2016-08-08 [Bug gdb/20057] Internal error on trying to set {char[]}$pc="string" palves at redhat dot com
2016-08-08 [Bug gdb/20007] 'section' command doesn't work ariscop at gmail dot com
2016-08-08 [Bug gdb/17607] With some locales, entering a valid floating point number gives "Invalid number" fabrizio.ge at tiscali dot it
2016-08-08 [Bug gdb/20057] Internal error on trying to set {char[]}$pc="string" palves at redhat dot com
2016-08-08 [Bug build/20027] Combined tree build fails with xmalloc libiberty conflict palves at redhat dot com
2016-08-08 [Bug gdb/20007] 'section' command doesn't work palves at redhat dot com
2016-08-08 [Bug python/19911] gdb.execute ("interpreter-exec mi \"-gdb-show width\"", to_string = True) with -i=mi2 crashes gdb palves at redhat dot com
2016-08-08 [Bug c++/19902] gdb wrongly steps back on this code (my unique_ptr) palves at redhat dot com
2016-08-08 [Bug breakpoints/19889] gFortran DLL Excel internal-error: virtual memory exhausted palves at redhat dot com
2016-08-08 [Bug cli/16440] "readline: readline_callback_read_char() called with no handler!" in debugging gdb at startup palves at redhat dot com
2016-08-08 [Bug server/19855] readline abort when debugging with rr palves at redhat dot com
2016-08-08 [Bug exp/19820] C Enumeration constants as non-integral types, print artificial array doesn't work palves at redhat dot com
2016-08-08 [Bug gdb/19811] register value is not correct in catchpoint syscall execve after vfork palves at redhat dot com
2016-08-08 [Bug record/19772] =record-started should specify the type of recording simon.marchi at ericsson dot com
2016-08-08 [Bug record/19772] =record-started should specify the type of recording palves at redhat dot com
2016-08-08 [Bug record/19772] =record-started should specify the type of recording simon.marchi at ericsson dot com
2016-08-08 [Bug gdb/19798] GDB server 7.11 doesn't build with uClibc-ng or musl based toolchains palves at redhat dot com
2016-08-08 [Bug record/19772] =record-started should specify the type of recording palves at redhat dot com
2016-08-08 [Bug gdb/19750] defining hook(post)-where produces "'hook(post)-where' command does not hook any existing command" palves at redhat dot com
2016-08-08 [Bug threads/19742] When a thread is stopped in non-stop mode, a breakpoint can not be set in another thread palves at redhat dot com
2016-08-08 [Bug c++/19730] GDB crashing before starting the debug session palves at redhat dot com
2016-08-08 [Bug breakpoints/18303] Assertation: -breakpoint-insert with windows paths of file in non-current directory palves at redhat dot com
2016-08-08 [Bug gdb/19711] 32-bit application linked with "-z now" causes GDB to fail stepping over/into lines (possibly because of R_386_GLOB_DAT) palves at redhat dot com
2016-08-08 [Bug breakpoints/19598] GDB breakpoint locks up Ubuntu UI, requiring reboot palves at redhat dot com
2016-08-08 [Bug c++/19597] Buffer Overflow during Demangling palves at redhat dot com
2016-08-08 [Bug fortran/19208] SIGSEV while opening Fortran program compiled with ifort palves at redhat dot com
2016-08-08 [Bug gdb/19555] segmentation fault reading symbols palves at redhat dot com
2016-08-08 [Bug gdb/19544] can't complete flash memory update palves at redhat dot com
2016-08-08 [Bug gdb/20448] target descriptions: bitfields vs flags backward/forward incompatible change palves at redhat dot com
2016-08-08 [Bug gdb/20448] New: target descriptions: bitfields vs flags backward/forward incompatible change palves at redhat dot com
2016-08-08 [Bug remote/19496] fork test failures in gdb.threads/forking-threads-plus-breakpoint with remote target donbreazeal at gmail dot com
2016-08-08 [Bug remote/19496] fork test failures in gdb.threads/forking-threads-plus-breakpoint with remote target palves at redhat dot com
2016-08-08 [Bug compile/20446] New: compile code inferior segv on accessing BSS variable jan.kratochvil at redhat dot com
2016-08-08 [Bug gdb/19980] Typo in gdbserver/configure.srv palves at redhat dot com
2016-08-08 [Bug gdb/20390] prefix_len + 1 palves at redhat dot com
2016-08-08 [Bug gdb/19841] remote debug via serial port not successful palves at redhat dot com
2016-08-07 [Bug python/20445] New: Python-related GDB sources are built with -DNDEBUG jan.kratochvil at redhat dot com
2016-08-06 [Bug sim/20438] GDB Simulator build failure on Blackfin with older gcc: common/sim-base.h:76: error: redefinition of typedef 'SIM_CPU' vapier at gentoo dot org
2016-08-05 [Bug sim/20438] GDB Simulator build failure on Blackfin with older gcc: common/sim-base.h:76: error: redefinition of typedef 'SIM_CPU' thomas dot petazzoni at free-electrons dot com
2016-08-05 [Bug sim/20438] GDB Simulator build failure on Blackfin with older gcc: common/sim-base.h:76: error: redefinition of typedef 'SIM_CPU' vapier at gentoo dot org
2016-08-05 [Bug sim/20438] GDB Simulator build failure on Blackfin vapier at gentoo dot org
2016-08-05 [Bug sim/20438] GDB Simulator build failure on Blackfin vapier at gentoo dot org
2016-08-05 [Bug sim/20438] GDB Simulator build failure on Blackfin thomas dot petazzoni at free-electrons dot com
2016-08-05 [Bug sim/20438] GDB Simulator build failure on Blackfin vapier at gentoo dot org
2016-08-05 [Bug remote/20398] File-IO write always outputs "Quit" palves at redhat dot com
2016-08-05 [Bug remote/20398] File-IO write always outputs QUIT. palves at redhat dot com
2016-08-05 [Bug remote/20398] File-IO write always outputs QUIT. cvs-commit at gcc dot gnu.org
2016-08-05 [Bug remote/20398] File-IO write always outputs QUIT. cvs-commit at gcc dot gnu.org
2016-08-04 [Bug gdb/20438] New: GDB Simulator build failure on Blackfin thomas dot petazzoni at free-electrons dot com
2016-08-04 [Bug gdb/18653] spawn changes SIGPIPE SIG_DFL to SIG_IGN palves at redhat dot com
2016-08-04 [Bug gdb/18653] spawn changes SIGPIPE SIG_DFL to SIG_IGN jan.kratochvil at redhat dot com
2016-08-03 [Bug breakpoints/20434] Restarting debug session "changes" breakpoints. brcowan at gmail dot com
2016-08-03 [Bug breakpoints/20434] New: Restarting debug session "changes" breakpoints. brcowan at gmail dot com
2016-08-03 [Bug python/18566] Frame filters cannot display minsyms tromey at sourceware dot org
2016-08-03 [Bug python/18565] Frame filters do not display inlined functions tromey at sourceware dot org
2016-08-03 [Bug python/18565] Frame filters do not display inlined functions cvs-commit at gcc dot gnu.org
2016-08-03 [Bug python/18565] Frame filters do not display inlined functions cvs-commit at gcc dot gnu.org
2016-08-03 [Bug python/18565] Frame filters do not display inlined functions cvs-commit at gcc dot gnu.org
2016-08-03 [Bug python/18565] Frame filters do not display inlined functions cvs-commit at gcc dot gnu.org
2016-08-03 [Bug remote/20398] File-IO write always outputs QUIT. palves at redhat dot com
2016-08-03 [Bug remote/19993] Crash when running info w32 tib ariscop at gmail dot com
2016-08-03 [Bug gdb/20007] 'section' command doesn't work ariscop at gmail dot com
2016-08-02 [Bug mi/20431] Missing MI prompts after sync execution MI command (-exec-continue, etc.) errors palves at redhat dot com
2016-08-02 [Bug gdb/20418] Problems with synchronous commands and new-ui palves at redhat dot com
2016-08-02 [Bug mi/20431] Missing MI prompts after sync execution MI command (-exec-continue, etc.) errors simon.marchi at ericsson dot com
2016-08-02 [Bug mi/20431] Missing MI prompts after sync execution MI command (-exec-continue, etc.) errors palves at redhat dot com
2016-08-02 [Bug mi/20431] Missing MI prompts after sync execution MI command (-exec-continue, etc.) errors simon.marchi at ericsson dot com
2016-08-02 [Bug mi/20431] Missing MI prompts after sync execution MI command (-exec-continue, etc.) errors simon.marchi at ericsson dot com
2016-08-02 [Bug mi/20431] Missing MI prompts after sync execution MI command (-exec-continue, etc.) errors marc.khouzam at ericsson dot com
2016-08-02 [Bug gdb/20418] Problems with synchronous commands and new-ui palves at redhat dot com
2016-08-02 [Bug mi/20431] Missing MI prompts after sync execution MI command (-exec-continue, etc.) errors palves at redhat dot com
2016-08-02 [Bug mi/20431] New: Missing MI prompts after sync execution MI command (-exec-continue, etc.) errors palves at redhat dot com
2016-08-02 [Bug pascal/20028] On pascal application closing error with stack overrun carlos at redhat dot com
2016-08-01 [Bug gdb/20418] Problems with synchronous commands and new-ui palves at redhat dot com
2016-08-01 [Bug gdb/20418] Problems with synchronous commands and new-ui palves at redhat dot com
2016-08-01 [Bug gdb/20418] Problems with synchronous commands and new-ui marc.khouzam at ericsson dot com
2016-08-01 [Bug gdb/20426] New: gdb does not interpret DWARF annotating imported units fully rguenth at gcc dot gnu.org
2016-07-29 [Bug gdb/20418] Problems with synchronous commands and new-ui simon.marchi at ericsson dot com
2016-07-29 [Bug gdb/20418] Problems with synchronous commands and new-ui simon.marchi at ericsson dot com
2016-07-29 [Bug gdb/20418] Problems with synchronous commands and new-ui palves at redhat dot com
2016-07-29 [Bug gdb/20418] Problems with synchronous commands and new-ui palves at redhat dot com
2016-07-29 [Bug gdb/20418] Problems with synchronous commands and new-ui simon.marchi at ericsson dot com
2016-07-29 [Bug gdb/20418] Problems with synchronous commands and new-ui simon.marchi at ericsson dot com
2016-07-29 [Bug gdb/20418] Problems with synchronous commands and new-ui simon.marchi at ericsson dot com
2016-07-29 [Bug gdb/20418] Problems with synchronous commands and new-ui simon.marchi at ericsson dot com
2016-07-29 [Bug gdb/20418] Problems with synchronous commands and new-ui simon.marchi at ericsson dot com
2016-07-28 [Bug gdb/20418] Problems with synchronous commands and new-ui palves at redhat dot com
2016-07-28 [Bug gdb/20418] Problems with synchronous commands and new-ui palves at redhat dot com
2016-07-28 [Bug gdb/20418] Problems with synchronous commands and new-ui marc.khouzam at ericsson dot com
2016-07-28 [Bug gdb/20418] Problems with synchronous commands and new-ui palves at redhat dot com
2016-07-28 [Bug gdb/20418] Problems with synchronous commands and new-ui palves at redhat dot com
2016-07-28 [Bug gdb/20418] Problems with synchronous commands and new-ui palves at redhat dot com
2016-07-28 [Bug gdb/20418] Problems with synchronous commands and new-ui palves at redhat dot com
2016-07-28 [Bug gdb/18077] Using -exec-run with mi-async on results in synchronous execution palves at redhat dot com
2016-07-28 [Bug gdb/20415] GDB does not compile on x32 native system palves at redhat dot com
2016-07-27 [Bug gdb/20418] New: Problems with synchronous commands and new-ui simon.marchi at ericsson dot com
2016-07-27 [Bug gdb/18077] Using -exec-run with mi-async on results in synchronous execution simon.marchi at ericsson dot com
2016-07-27 [Bug gdb/20417] 'make install' fails when documentation tools are not available noloader at gmail dot com
2016-07-27 [Bug gdb/20417] New: 'make install' fails when documentation tools are not available noloader at gmail dot com
2016-07-27 [Bug gdb/20415] GDB does not compile on x32 native system walfred.tedeschi at intel dot com
2016-07-27 [Bug gdb/20415] GDB does not compile on x32 native system palves at redhat dot com
2016-07-27 [Bug gdb/20415] GDB does not compile on x32 native system walfred.tedeschi at intel dot com
2016-07-27 [Bug gdb/20415] GDB does not compile on x32 native system palves at redhat dot com
2016-07-27 [Bug gdb/20415] New: GDB does not compile on x32 native system walfred.tedeschi at intel dot com
2016-07-27 [Bug server/20414] x32 gdbserver always crashes inferior equationssolver at yahoo dot com
2016-07-27 [Bug gdb/20287] X32 and "gdb_static_assert (sizeof (nat_siginfo_t) == sizeof (siginfo_t))" equationssolver at yahoo dot com
2016-07-27 [Bug gdb/20413] x32: linux_ptrace_test_ret_to_nx: Cannot PTRACE_PEEKUSER equationssolver at yahoo dot com
2016-07-26 [Bug gdb/20287] X32 and "gdb_static_assert (sizeof (nat_siginfo_t) == sizeof (siginfo_t))" palves at redhat dot com
2016-07-26 [Bug server/20414] x32 gdbserver always crashes inferior palves at redhat dot com
2016-07-26 [Bug server/20414] x32 gdbserver always crashes inferior cvs-commit at gcc dot gnu.org
2016-07-26 [Bug python/20190] TLS symbol claims to need a frame tromey at sourceware dot org
2016-07-26 [Bug python/20190] TLS symbol claims to need a frame cvs-commit at gcc dot gnu.org
2016-07-26 [Bug server/20414] x32 gdbserver always crashes inferior palves at redhat dot com
2016-07-26 [Bug gdb/20287] X32 and "gdb_static_assert (sizeof (nat_siginfo_t) == sizeof (siginfo_t))" palves at redhat dot com
2016-07-26 [Bug server/20414] x32 gdbserver always crashes inferior palves at redhat dot com
2016-07-26 [Bug server/20414] New: x32 gdbserver always crashes inferior palves at redhat dot com
2016-07-26 [Bug gdb/20287] X32 and "gdb_static_assert (sizeof (nat_siginfo_t) == sizeof (siginfo_t))" palves at redhat dot com
2016-07-26 [Bug gdb/20413] x32: linux_ptrace_test_ret_to_nx: Cannot PTRACE_PEEKUSER palves at redhat dot com
2016-07-26 [Bug gdb/20287] X32 and "gdb_static_assert (sizeof (nat_siginfo_t) == sizeof (siginfo_t))" palves at redhat dot com
2016-07-26 [Bug gdb/20413] x32: linux_ptrace_test_ret_to_nx: Cannot PTRACE_PEEKUSER cvs-commit at gcc dot gnu.org
2016-07-26 [Bug gdb/20287] X32 and "gdb_static_assert (sizeof (nat_siginfo_t) == sizeof (siginfo_t))" cvs-commit at gcc dot gnu.org
2016-07-26 [Bug gdb/20287] X32 and "gdb_static_assert (sizeof (nat_siginfo_t) == sizeof (siginfo_t))" palves at redhat dot com
2016-07-26 [Bug gdb/20413] New: x32: linux_ptrace_test_ret_to_nx: Cannot PTRACE_PEEKUSER palves at redhat dot com
2016-07-26 [Bug gdb/20287] X32 and "gdb_static_assert (sizeof (nat_siginfo_t) == sizeof (siginfo_t))" palves at redhat dot com
2016-07-26 [Bug gdb/20287] X32 and "gdb_static_assert (sizeof (nat_siginfo_t) == sizeof (siginfo_t))" walfred.tedeschi at intel dot com
2016-07-26 [Bug gdb/20287] X32 and "gdb_static_assert (sizeof (nat_siginfo_t) == sizeof (siginfo_t))" equationssolver at yahoo dot com
2016-07-26 [Bug gdb/20412] New: PowerPC: Set architecture command doesn't load proper description alfedotov at gmail dot com
2016-07-26 [Bug gdb/20411] New: PowerPC: Cant step after "set tdesc filename powerpc-e500.xml" alfedotov at gmail dot com
2016-07-25 [Bug build/20409] New: 1877-424-6647hp printer customer support phone number hp printer techncial support ffghjhmn at yopmail dot com
2016-07-25 [Bug build/20407] New: ++++hp=printer=1=8=7=7=4=2=4=6=6=4=7==hp@printer@technical@support@phone@number@hp@printer@customer@support@phone@number Gall1954 at superrito dot com
2016-07-25 [Bug record/19187] running with process record over a fork causes GDB internal error palves at redhat dot com
2016-07-25 [Bug exp/19999] gdb not able to resolve argc, argv with fission when built as PIE kmenc15 at gmail dot com
2016-07-25 [Bug gdb/20405] all variables are optimized out when using -gsplit-dwarf -O -fPIC kmenc15 at gmail dot com
2016-07-25 [Bug record/19187] running with process record over a fork causes GDB internal error qiyao at gcc dot gnu.org
2016-07-25 [Bug tdep/20406] New: Missing `alloca' handler in the microMIPS heuristic prologue scanner macro at linux-mips dot org
2016-07-25 [Bug gdb/20405] New: all variables are optimized out when using -gsplit-dwarf -O -fPIC kmenc15 at gmail dot com
2016-07-24 [Bug gdb/20403] New: Print whether gdb was compiled with python dilyan.palauzov at aegee dot org
2016-07-23 [Bug tdep/17233] possible bug in amd64-tdep.c:fixup_riprel tromey at sourceware dot org
2016-07-23 [Bug win32/14529] Make gdb capable of JIT-debugging on W32 cvs-commit at gcc dot gnu.org
2016-07-22 [Bug rust/20162] fix regressions in rust "1.11" (nightly) tromey at sourceware dot org
2016-07-22 [Bug rust/20162] fix regressions in rust "1.11" (nightly) cvs-commit at gcc dot gnu.org
2016-07-22 [Bug c++/20400] New: m-static test fails to compile tromey at sourceware dot org
2016-07-22 [Bug c++/20399] New: casts.cc test case fails to compile tromey at sourceware dot org
2016-07-22 [Bug remote/20398] New: File-IO write always outputs QUIT. currygt52 at gmail dot com
2016-07-21 [Bug remote/20396] async_remote_interrupt_twice firing too quickly palves at redhat dot com
2016-07-21 [Bug gdb/20397] New: Singlestepping continues way beyond where it should. dje at google dot com
2016-07-21 [Bug python/17234] unused variables in py-framefilter.c tromey at sourceware dot org
2016-07-21 [Bug symtab/17236] bug in dwarf2_add_member_fn tromey at sourceware dot org
2016-07-21 [Bug build/20371] add -Wunused-but-set-parameter and -Wunused-but-set-variable tromey at sourceware dot org
2016-07-21 [Bug remote/20396] New: async_remote_interrupt_twice firing too quickly sstallion at gmail dot com
2016-07-21 [Bug mi/20395] New: -var-update gives incorrect register values for frames 1 and above donbreazeal at gmail dot com
2016-07-21 [Bug gdb/20287] X32 and "gdb_static_assert (sizeof (nat_siginfo_t) == sizeof (siginfo_t))" palves at redhat dot com
2016-07-21 [Bug gdb/20287] X32 and "gdb_static_assert (sizeof (nat_siginfo_t) == sizeof (siginfo_t))" equationssolver at yahoo dot com
2016-07-21 [Bug gdb/19194] Typo "functiop" in gdb manpage palves at redhat dot com
2016-07-21 [Bug sim/18273] sim: various cppcheck warnings palves at redhat dot com
2016-07-21 [Bug python/20129] error from disable frame-filter palves at redhat dot com
2016-07-21 [Bug python/19819] useless code in py-xmethod.c palves at redhat dot com
2016-07-21 [Bug python/19438] dir(objfile) leads to a segmentation fault palves at redhat dot com
2016-07-21 [Bug backtrace/19293] enabling or disabling an unwinder doesn't affect "bt" palves at redhat dot com
2016-07-21 [Bug python/18984] gdb.solib_name doesn't convert to address properly palves at redhat dot com
2016-07-21 [Bug gdb/18947] [aarch64]Step into shared library is very slow. palves at redhat dot com
2016-07-21 [Bug python/18620] No "breakpoint modified" event palves at redhat dot com
2016-07-21 [Bug python/18393] GDB 7.9 segfaults on: python dir(gdb.current_progspace()) palves at redhat dot com
2016-07-21 [Bug cli/18053] jit-reader-load should use filename completion palves at redhat dot com
2016-07-21 [Bug python/17981] gdb.breakpoints() returns None if there are no breakpoints; should return empty sequence palves at redhat dot com
2016-07-21 [Bug python/17698] There is no access to "pending" state of gdb.Breakpoint palves at redhat dot com
2016-07-21 [Bug python/17386] gdb.Value should have __index__ method palves at redhat dot com
2016-07-21 [Bug gdb/17210] read_memory_robust can leak memory palves at redhat dot com
2016-07-21 [Bug python/15620] no "new breakpoint" event palves at redhat dot com
2016-07-21 [Bug rust/20110] wrong type for integer constant palves at redhat dot com
2016-07-21 [Bug remote/19998] interrupt test failing due to SIGINT failing to interrupt palves at redhat dot com
2016-07-21 [Bug gdb/19947] read_code should throw right exception palves at redhat dot com
2016-07-21 [Bug server/19736] GDBserver gets internal error when the thread which is stepping over breakpoint fork/vfork/clone new thread palves at redhat dot com
2016-07-21 [Bug tdep/19051] incorrect/missing AAPCS vector support on ARM palves at redhat dot com
2016-07-21 [Bug testsuite/18139] gdb.linespec/break-asm-file.exp needs some tweak for non-x86 target palves at redhat dot com
2016-07-21 [Bug tdep/18107] syscall catchpoint isn't supported on aarch64-linux palves at redhat dot com
2016-07-21 [Bug python/16483] "info frame-filter" too verbose with many objfiles palves at redhat dot com
2016-07-21 [Bug mi/20034] "set editing on" with MI as top-level interpreter -> gdb aborts palves at redhat dot com
2016-07-21 [Bug cli/17539] inferiors print in reverse order palves at redhat dot com
2016-07-21 [Bug server/20392] New: gdb "run" command hangs jan.kratochvil at redhat dot com
2016-07-20 [Bug gdb/20373] dump mem <file> 0x400400 -1: Virtual Memory Exhausted (utils.c:1072) palves at redhat dot com
2016-07-20 [Bug fortran/18475] "p y(nv1:lrow)" hits cp-namespace.c:341: internal-error: cp_search_static_and_baseclasses: Assertion `name[prefix_len + 1] == ':'' failed keiths at redhat dot com
2016-07-20 [Bug gdb/20390] prefix_len + 1 martin.bochud at geoazimut dot com
2016-07-20 [Bug gdb/20390] prefix_len + 1 sergiodj at redhat dot com
2016-07-20 [Bug gdb/20390] prefix_len + 1 martin.bochud at geoazimut dot com
2016-07-20 [Bug gdb/20390] prefix_len + 1 sergiodj at redhat dot com
2016-07-20 [Bug fortran/18475] "p y(nv1:lrow)" hits cp-namespace.c:341: internal-error: cp_search_static_and_baseclasses: Assertion `name[prefix_len + 1] == ':'' failed martin.bochud at geoazimut dot com
2016-07-20 [Bug gdb/20390] New: prefix_len + 1 martin.bochud at geoazimut dot com
2016-07-19 [Bug exp/16479] @entry is needlessly cruel tromey at sourceware dot org
2016-07-19 [Bug mi/20385] New: Executing "info frame" with non-existing frame number crashes gdb korcankaraokcu at gmail dot com
2016-07-17 [Bug testsuite/20328] ppc64: gdb_target_symbol does not support function descriptors jan.kratochvil at redhat dot com
2016-07-15 [Bug gdb/18717] gdb misbehaves if non-leader thread exits process mdennis at merfer dot net
2016-07-15 [Bug gdb/18717] gdb misbehaves if non-leader thread exits process bugzilla at thepaul dot org
2016-07-15 [Bug gdb/20373] New: dump mem <file> 0x400400 -1: Virtual Memory Exhausted (utils.c:1072) pieterkockx at gmail dot com
2016-07-14 [Bug breakpoints/16880] GDB does not step into template functions OS X Mavericks vsoftco at gmail dot com
2016-07-14 [Bug rust/20367] add further Rust demangling tromey at sourceware dot org
2016-07-14 [Bug build/20371] New: add -Wunused-but-set-parameter and -Wunused-but-set-variable tromey at sourceware dot org
2016-07-14 [Bug breakpoints/16880] GDB does not step into template functions OS X Mavericks bernhard.heckel at intel dot com
2016-07-14 [Bug fortran/15326] Problem inspecting recursive Derived Data Type bernhard.heckel at intel dot com
2016-07-14 [Bug fortran/8415] GDB has problem with internal subroutines (variable visibility) bernhard.heckel at intel dot com
2016-07-14 [Bug gdb/20368] New: gdb embedded in NXP LPCXpresso Eclipse based IDE jim at princepower dot com
2016-07-13 [Bug python/15620] no "new breakpoint" event tromey at sourceware dot org
2016-07-13 [Bug python/18620] No "breakpoint modified" event tromey at sourceware dot org
2016-07-13 [Bug python/18620] No "breakpoint modified" event cvs-commit at gcc dot gnu.org
2016-07-13 [Bug python/15620] no "new breakpoint" event cvs-commit at gcc dot gnu.org
2016-07-13 [Bug python/17698] There is no access to "pending" state of gdb.Breakpoint tromey at sourceware dot org
2016-07-13 [Bug cli/18053] jit-reader-load should use filename completion tromey at sourceware dot org
2016-07-13 [Bug python/17698] There is no access to "pending" state of gdb.Breakpoint cvs-commit at gcc dot gnu.org
2016-07-13 [Bug rust/20367] New: add further Rust demangling tromey at sourceware dot org
2016-07-13 [Bug cli/18053] jit-reader-load should use filename completion cvs-commit at gcc dot gnu.org
2016-07-12 [Bug backtrace/19293] enabling or disabling an unwinder doesn't affect "bt" tromey at sourceware dot org
2016-07-12 [Bug backtrace/19293] enabling or disabling an unwinder doesn't affect "bt" cvs-commit at gcc dot gnu.org
2016-07-12 [Bug tdep/20362] New: bug in arm-tdep.c tromey at sourceware dot org
2016-07-12 [Bug build/20361] New: add -Wmisleading-indentation tromey at sourceware dot org
2016-07-10 [Bug breakpoints/20345] call_function_by_hand_dummy: Assertion `tp->thread_fsm == &sm->thread_fsm' failed irotem at cisco dot com
2016-07-10 [Bug breakpoints/20345] New: call_function_by_hand_dummy: Assertion `tp->thread_fsm == &sm->thread_fsm' failed irotem at cisco dot com
2016-07-05 [Bug tui/18932] list command doesn't work in TUI any more mrfirmware at gmail dot com
2016-07-05 [Bug testsuite/20328] ppc64: gdb_target_symbol does not support function descriptors jan.kratochvil at redhat dot com
2016-07-05 [Bug testsuite/20328] New: ppc64: gdb_target_symbol does not support function descriptors jan.kratochvil at redhat dot com
2016-07-05 [Bug gdb/13669] Infinite recursion in cp_print_value_fields gbr at voidland dot org
2016-07-05 [Bug breakpoints/20322] gdb misses breakpoints after call to clone() dkondor at mit dot edu
2016-07-04 [Bug gdb/19797] Unsupported powerpc bfd arch/machine variants alfedotov at gmail dot com
2016-07-04 [Bug gdb/19797] Unsupported powerpc bfd arch/machine variants alfedotov at gmail dot com
2016-07-03 [Bug testsuite/20325] New: gdb.gdb/ fail for C++ -O2 built GDB jan.kratochvil at redhat dot com
2016-07-01 [Bug breakpoints/20322] gdb misses breakpoints after call to clone() dkondor at mit dot edu
2016-07-01 [Bug breakpoints/20322] New: gdb misses breakpoints after call to clone() dkondor at mit dot edu
Indexes: [Date Index] [Subject Index] [Author Index] [Thread Index]
Site Nav: [Browse other archives for this mailing list]
[Browse other mailing lists at this site]
Search: Limit to:

Mail converted by MHonArc